{"text_format":"1","workbook":"xlsx","n_sheets":7,"sheets":["Info","Compactage et Avancement","Estimation Teneur MS","Calcul","Lists","Text","Dev"],"not_rendered":{"charts":0,"images":2,"macros":0,"external_links":0,"defined_names":29,"comments":0,"pivot_tables":0},"unopened":[],"bounds":{"document_bytes":16777216,"sheet_cells":100000,"rows_first":2000,"rows_last":500,"rows_between":2000,"halvings":0,"cell_chars":16384,"cell_head_chars":4096},"cells_cut":0,"cells_raw":0,"read":"whole","date_system":"1900"}

{"sheet":"Info","index":0,"n_rows":62,"n_cols":4,"rows_kept":62,"cut":false,"hidden":false,"merged":[]}
[]
[]
[]
[]
[null,{"$f":"Text!A183","v":"Explications SiloDim"}]
[null,{"$f":"Calcul!K3","v":"Version 2.1a"}]
[null,{"$f":"Calcul!J3","v":0}]
[null,{"$f":"Text!A184","v":"Base de l'outil de calcul: fiche « Dimensionnement des silos pour le fourrage », mars 2025. "}]
[null,"https://url.agridea.ch/SiloDim"]
[null,{"$f":"Text!A181","v":"Les liens sont insérés dans l'outil sous forme de texte afin de garantir un téléchargement sans problème et"}]
[null,{"$f":"Text!A180","v":"d'éviter les restrictions dues aux demandes de sécurité. Copiez le lien dans votre navigateur. "}]
[]
[null,{"$f":"Text!A185","v":"Les cellules de la feuille |Calcul| ont un fond de couleur différent : "}]
[null,{"$f":"Text!A186","v":"Blanc"},"=",{"$f":"Text!A187","v":"Valeurs fixes prédéfinies ou texte"}]
[null,{"$f":"Text!A188","v":"Jaune"},"=",{"$f":"Text!A189","v":"Cellules avec données pouvant être librement choisies ou modifiées. "}]
[null,{"$f":"Text!A190","v":"Vert"},"=",{"$f":"Text!A191","v":"Une case avec une flèche apparaît à droite si l'on sélectionne la cellule "}]
[null,null,null,{"$f":"Text!A192","v":"Après avoir cliqué sur la flèche, on peut sélectionner la valeur dans la liste "}]
[]
[null,{"$f":"Text!A193","v":"Texte en bleu"},null,{"$f":"Text!A194","v":"Ici on peut calculer variantes de planification pour dimensions du silo. "}]
[null,null,null,{"$f":"Text!A205","v":"avec des données concrètes."}]
[]
[null,{"$f":"Text!A176","v":"Vue d'écran"}]
[null,{"$f":"Text!A177","v":"La vue dans la feuille |Calcul| est optimisée pour l'affichage sur l'écran d'un PC.  "}]
[null,{"$f":"Text!A178","v":"Si des inscriptions sont coupées, modifiez le facteur de zoom avec le curseur en bas à droite "}]
[null,{"$f":"Text!A179","v":"ou via menu [Affichage] > Zoom - « personnalisé », pour trouver le meilleur réglage  "}]
[]
[null,{"$f":"Text!A195","v":"Détermination des besoins en affouragement"}]
[null,{"$f":"Text!A196","v":"Besoin en fourrage à saisir sur base de planification alimentation spécifique à l'exploitation.   "}]
[null,{"$f":"Text!A197","v":"Besoins pour alimentation d'été et d'hiver présentés séparément, car rations très différentes, "}]
[null,{"$f":"Text!A198","v":"par exemple en raison de la part de pâturage. "}]
[null,{"$f":"Text!A199","v":"Valeurs proposées au tableau « Besoins en fourrage de base » du PLANETE d'AGRIDEA ou des GRUD. "}]
[null,{"$f":"Text!A200","v":"Valeurs à adapter en fonction de performance effective et des valeurs empiriques  plan d'affouragement. "}]
[]
[null,{"$f":"Text!A201","v":"Résidus de fourrage"}]
[null,{"$f":"Text!A202","v":"Pour part en % résidus de fourrage, saisir  valeur empirique de l'exploitation. "}]
[]
[null,{"$f":"Text!A203","v":"Volume des réserves de silo"}]
[null,{"$f":"Text!A204","v":"Valeur fixée en fonction des fluctuations de rendement régulières sur l'exploitation. "}]
[]
[null,{"$f":"Text!A206","v":"Détermination des besoins en espaces de stockage"}]
{"$rows_left_out":23}
{"sheet":"Compactage et Avancement","index":1,"n_rows":24,"n_cols":6,"rows_kept":24,"cut":false,"hidden":false,"merged":[]}
[]
[null,{"$f":"Text!$A$124","v":"Valeurs pour estimer les conditions d'ensilage "}]
[]
[null,{"$f":"Text!A125","v":"pour le compactage lors du désilage"}]
[]
[null,{"$f":"Text!$A$127","v":"Conditions d'ensilage "},null,{"$f":"Lists!B4","v":"bon"},{"$f":"Lists!B5","v":"moyen"},{"$f":"Lists!B6","v":"mauvais"}]
[null,{"$f":"Text!$A$128","v":"Compactage"},null,{"$f":"Text!$A$129","v":"kg MS / m³"},{"$f":"D7","v":"kg MS / m³"},{"$f":"D7","v":"kg MS / m³"}]
[null,{"$f":"Text!$A$130","v":"Herbe"},{"$f":"Lists!B13","v":"< 25 % MS"},190,170,150]
[null,{"$f":"B8","v":"Herbe"},{"$f":"Lists!B14","v":"25 - 35 % MS"},210,190,170]
[null,{"$f":"B8","v":"Herbe"},{"$f":"Lists!B15","v":"> 35 % MS"},230,210,190]
[]
[null,{"$f":"Text!$A$131","v":"Maïs"},{"$f":"Lists!B9","v":"< 30 % MS"},230,210,190]
[null,{"$f":"B12","v":"Maïs"},{"$f":"Lists!B10","v":"30 - 35 % MS"},250,230,200]
[null,{"$f":"B12","v":"Maïs"},{"$f":"Lists!B11","v":"> 35 % MS"},270,250,220]
[]
[null,{"$f":"Text!A119","v":"En se basant sur les valeurs de compactage mentionnées ci-dessus, on obtient les valeurs ci-dessous "}]
[null,{"$f":"Text!A126","v":"pour l'avancement lors du désilage"}]
[]
[null,{"$f":"Text!$A$132","v":"Avancement"},null,{"$f":"Text!A122","v":"m / semaine"},{"$f":"D19","v":"m / semaine"},{"$f":"D19","v":"m / semaine"}]
[null,{"$f":"Text!$A$133","v":"Hiver"},null,{"$f":"Text!$A$134","v":"< 0.75"},{"$f":"Text!$A$135","v":"0.75 - 1.5"},{"$f":"Text!$A$136","v":"> 1.5"}]
[null,{"$f":"Text!$A$137","v":"Eté"},null,{"$f":"Text!$A$138","v":"< 1.5"},{"$f":"Text!$A$139","v":"1.5 - 2.5"},{"$f":"Text!$A$140","v":"> 2.5"}]
[]
[null,{"$f":"Text!$A$141","v":"Ces chiffres sont données à titre indicatif et ne doivent pas être considérés comme une limite rigide absolue."}]
[null,{"$f":"Text!$A$142","v":"Source: dlg-Praxishandbuch Futter- und Substratkonzentrierung (2012), p. 96"}]

{"sheet":"Estimation Teneur MS","index":2,"n_rows":36,"n_cols":10,"rows_kept":36,"cut":false,"hidden":false,"merged":[]}
[]
[null,{"$f":"Text!A156","v":"Estimation de la teneur en matière sèche à l'aide d'un essai manuel"}]
[]
[null,{"$f":"Text!A150","v":"Ensilage herbe"}]
[]
[null,{"$f":"Text!A152","v":"Essorez l'échantillon comme un gant de toilette, sans le resaissir (test du boudin). "}]
[null,{"$f":"Text!A153","v":"Si l'ensilage est très humide, pressez-en une boule dans votre main (test de la boule). "}]
[]
[null,{"$f":"Text!A147","v":"Type d'échantillon"},{"$f":"Text!A148","v":"Perte de jus"},null,null,null,null,null,null,{"$f":"Text!A149","v":"Teneur en MS"}]
[null,{"$f":"Text!A154","v":"Test boule"},{"$f":"Text!$A$159","v":"Ecoulement de jus lors d'une légère pression"},null,null,null,null,null,null,{"$f":"Lists!B109","v":"< 20 %"}]
[null,{"$f":"Text!A154","v":"Test boule"},{"$f":"Text!$A$160","v":"Ecoulement de jus lors d'une forte pression"},null,null,null,null,null,null,{"$f":"Lists!B110","v":"25 %"}]
[null,{"$f":"Text!A155","v":"Test brin"},{"$f":"Text!$A$161","v":"Jus entre les doigts après l'essorage "},null,null,null,null,null,null,{"$f":"Lists!B111","v":"30 %"}]
[null,{"$f":"Text!A155","v":"Test brin"},{"$f":"Text!$A$162","v":"Pas de jus entre les doigts après l'essorage, mais mains humides"},null,null,null,null,null,null,{"$f":"Lists!B112","v":"35 %"}]
[null,{"$f":"Text!A155","v":"Test brin"},{"$f":"Text!$A$163","v":"Les mains brillent après l'essorage"},null,null,null,null,null,null,{"$f":"Lists!B113","v":"40 %"}]
[null,{"$f":"Text!A155","v":"Test brin"},{"$f":"Text!$A$164","v":"Légère impression d'humidité après l'essorage "},null,null,null,null,null,null,{"$f":"Lists!B114","v":"45 %"}]
[null,{"$f":"Text!A155","v":"Test brin"},{"$f":"Text!$A$165","v":"Les mains sont complètement sèches après l'essorage"},null,null,null,null,null,null,{"$f":"Lists!B115","v":"> 45 %"}]
[]
[null,{"$f":"Text!A166","v":"de la fiche  « Clé pour l'évaluation de la qualité de l'ensilage d'herbe » (AGFF-K3b) "}]
[]
[null,{"$f":"Text!A151","v":"Ensilage maïs"}]
[]
[null,{"$f":"Text!A167","v":"Prenez suffisamment d'ensilage de maïs dans votre main pour que celle-ci ne soit pas complètement fermée. Appuyez"}]
[null,{"$f":"Text!A168","v":"ensuite sur l'ensilage de maïs sans presser. Observez l'apparition de liquide ou d'humidité entre les doigts. "}]
[]
[null,{"$f":"C9","v":"Perte de jus"},null,null,null,null,null,null,null,{"$f":"J9","v":"Teneur en MS"}]
[null,{"$f":"Text!A169","v":"Le jus s'écoule de manière très visible"},null,null,null,null,null,null,null,{"$f":"Lists!B117","v":"< 30 %"}]
[null,{"$f":"Text!A170","v":"Il s'écoule un peu de jus"},null,null,null,null,null,null,null,{"$f":"Lists!B118","v":"30 - 32 %"}]
[null,{"$f":"Text!A171","v":"Il y a un peu d'humidité entre les doigts, mais rien ne s'écoule "},null,null,null,null,null,null,null,{"$f":"Lists!B119","v":"32 - 36 %"}]
[null,{"$f":"Text!A172","v":"On sent encore un peu d'humidité"},null,null,null,null,null,null,null,{"$f":"Lists!B120","v":"36 - 38 %"}]
[null,{"$f":"Text!A173","v":"On ne sent plus d'humidité"},null,null,null,null,null,null,null,{"$f":"Lists!B121","v":"> 38 %"}]
[]
[null,{"$f":"Text!A174","v":"de la fiche « Clé pour l'évaluation de la qualité de l'ensilage de maïs » (AGFF-K3c) "}]
[]
[null,{"$f":"Text!A229","v":"Rumiplan"}]
[null,"https://www.barto.ch/fr/modules/vue-densemble/rumiplan-370"]
[null,{"$f":"Text!A230","v":"Lien sous forme de texte: Copiez le lien dans votre navigateur pour accéder à Rumiplan."}]

{"sheet":"Calcul","index":3,"n_rows":87,"n_cols":27,"rows_kept":87,"cut":false,"hidden":false,"merged":[]}
[]
[]
[null,null,null,null,null,null,null,null,null,null,{"$f":"Text!$A$107","v":"Version 2.1a"}]
[null,{"$f":"Text!$A$6","v":"Planifier les dimensions du silo"}]
[null,null,null,null,null,null,null,{"$f":"Text!$A$7","v":"Variante"}]
[null,{"$f":"Text!$A$8","v":"Projet de construction"},null,null,null,null,null,{"$f":"Text!$A$9","v":"No du projet"}]
[null,{"$f":"Text!$A$10","v":"Conseiller(ère) "}]
[]
[null,{"$f":"Text!$A$11","v":"Désignation de l'exploitation"}]
[null,{"$f":"Text!$A$12","v":"Nom, prénom"}]
[null,{"$f":"Text!$A$13","v":"Rue, numéro "}]
[null,{"$f":"Text!$A$14","v":"NPA, lieu"},null,null,null,null,null,{"$f":"Text!$A$15","v":"Canton"}]
[null,{"$f":"Text!$A$16","v":"Téléphone"},null,null,null,null,null,{"$f":"Text!$A$17","v":"Fax, e-mail"}]
[]
[null,null,null,null,null,null,null,null,null,null,{"$f":"IF(L15=1,Text!A52,\"\")","v":""},{"$f":"IF(AND(SUM(H23:I33)>0,I16=0),1,0)","v":0}]
[null,{"$f":"Text!$A$18","v":"Période estivale et hivernale en jours"},null,null,null,{"$f":"Text!$A$19","v":"Année"},365,{"$f":"Text!$A$20","v":"Eté"},null,{"$f":"Text!$A$21","v":"Hiver"},{"$f":"G16-I16","v":365},null,null,null,null,null,"Grundannahmen, für produktive Version wieder entfernen"]
[null,null,null,null,null,null,{"$f":"G$16/7","v":52.142857142857146},null,{"$f":"I$16/7","v":0},null,{"$f":"K$16/7","v":52.142857142857146}]
[null,{"$f":"Text!$A$22","v":"Besoins fourrages de base"},null,null,null,{"$f":"Text!$A$23","v":"Besoins en ensilage"},null,{"$f":"Text!$A$30","v":"Part de fourrages de base"},null,{"$f":"Text!$A$30","v":"Part de fourrages de base"}]
[null,null,null,null,null,{"$f":"Text!$A$26","v":"durant toute l'année"},null,{"$f":"Text!A24","v":"en été"},null,{"$f":"Text!A25","v":"en hiver"}]
[null,null,null,null,{"$f":"Text!$A$27","v":"Fourrage de base"},{"$f":"Text!A108","v":"Ensilage"},{"$f":"F20","v":"Ensilage"},{"$f":"F20","v":"Ensilage"},{"$f":"H20","v":"Ensilage"},{"$f":"H20","v":"Ensilage"},{"$f":"H20","v":"Ensilage"},"werden später wieder entfernt"]
[null,{"$f":"Text!$A$31","v":"Animaux"},null,{"$f":"Text!$A$32","v":"Places"},{"$f":"Text!$A$33","v":"par animal en"},{"$f":"Text!A109","v":"d'herbe"},{"$f":"Text!A110","v":"de maïs"},{"$f":"F21","v":"d'herbe"},{"$f":"G21","v":"de maïs"},{"$f":"H21","v":"d'herbe"},{"$f":"G21","v":"de maïs"},"Gras- und Mais-","Restliches Grund-","GrundfutterVZ",null,null,"Der Grundfutterverzehr wird in TS angegeben."]
[null,null,null,null,{"$f":"Text!$A$35","v":"kg MS par jour"},{"$f":"Text!A34","v":"kg MS"},{"$f":"F22","v":"kg MS"},{"$f":"Text!$A$36","v":"en %"},{"$f":"H22","v":"en %"},{"$f":"H22","v":"en %"},{"$f":"H22","v":"en %"},"silage in kg TS","futter in kg TS","Jahr gesamt in kg TS",null,null,"Anteil am Grundfutter:"]
[null,{"$f":"Text!$A$37","v":"Vaches laitières"},{"$f":"Text!$A$38","v":"en lactation"},null,{"$f":"IF(D23>0,AA23,0)","v":0},{"$f":"$D23*$E23*(H23*$I$16 + J23*$K$16)/100","v":0},{"$f":"$D23*$E23*(I23*$I$16 + K23*$K$16)/100","v":0},null,null,null,null,{"$f":"F23+G23","v":0},{"$f":"N23-L23","v":0},{"$f":"D23*E23*365","v":0},null,null,"Aufteilung in Grassilage, Maissilage, Rest ",null,null,null,null,null,null,null,null,null,15.6]
[null,{"$f":"B23","v":"Vaches laitières"},{"$f":"Text!$A$39","v":"non suitées"},null,0,{"$f":"$D24*$E24*(H24*$I$16 + J24*$K$16)/100","v":0},{"$f":"$D24*$E24*(I24*$I$16 + K24*$K$16)/100","v":0},null,null,null,null,{"$f":"F24+G24","v":0},{"$f":"N24-L24","v":0},0,null,null,"im Rest sind alle anderen Grundfutter berücksichtigt,",null,null,null,null,null,null,null,null,null,11.1]
[null,{"$f":"Text!$A$40","v":"Gén. d'élevage"},{"$f":"Text!$A$41","v":"<= 1 an"},null,0,0,0,null,null,null,null,0,0,0,null,null,"einschliesslich Weideanteil",null,null,null,null,null,null,null,null,null,3]
[null,{"$f":"B25","v":"Gén. d'élevage"},{"$f":"Text!$A$42","v":"1 à 2 ans"},null,0,0,0,null,null,null,null,0,0,0,null,null,"Hier wird nur noch ein getragen, wieviel % an Silage gefüttert werden",null,null,null,null,null,null,null,null,null,7.1]
[null,{"$f":"B25","v":"Gén. d'élevage"},{"$f":"Text!$A$43","v":"> 2 ans"},null,0,0,0,null,null,null,null,0,0,0,null,null,"das bedeutet:",null,null,null,null,null,null,null,null,null,9]
[null,{"$f":"Text!$A$44","v":"Bovins à l'engr."},{"$f":"Text!$A$45","v":"< 160 jours"},null,0,0,0,null,null,null,null,0,0,0,null,null,"Summe Gras- und Maissilage < 100 %",null,null,null,null,null,null,null,null,null,3.85]
[null,{"$f":"B28","v":"Bovins à l'engr."},{"$f":"Text!$A$46","v":"> 160 jours"},null,0,0,0,null,null,null,null,0,0,0,null,null,"und maximal 100 % (nur eine Art von Silage und NICHTS ANDERES)",null,null,null,null,null,null,null,null,null,5.6]
[null,null,null,null,null,0,0,null,null,null,null,0,0,0,null,null,null,null,null,null,null,null,null,null,null,null,3.83]
[null,null,null,null,null,0,0,null,null,null,null,0,0,0]
[null,null,null,null,null,0,0,null,null,null,null,0,0,0]
[null,null,null,null,null,0,0,null,null,null,null,0,0,0]
[]
[null,{"$f":"Text!$A$47","v":"Valeur calculée de consommation MS"},null,{"$f":"Text!$A$48","v":"kg MS"},{"$f":"Text!$A$49","v":"kg par semaine"},{"$f":"F36/$G$17","v":0},{"$f":"G36/$G$17","v":0},{"$f":"SUMPRODUCT($E23:$E33,H23:H33,$D23:$D33)*7/100","v":0},{"$f":"SUMPRODUCT($E23:$E33,I23:I33,$D23:$D33)*7/100","v":0},{"$f":"SUMPRODUCT($E23:$E33,J23:J33,$D23:$D33)*7/100","v":0},{"$f":"SUMPRODUCT($E23:$E33,K23:K33,$D23:$D33)*7/100","v":0},{"$f":"L36/$G$17","v":0},{"$f":"M36/$G$17","v":0},{"$f":"N36/$G$17","v":0},null,null,"Faktor Sommertage / 365 in Formel, da Eingabe Ganzjahresplätze"]
[null,null,null,null,{"$f":"Text!$A$50","v":"par an"},{"$f":"SUM(H36,J36)","v":0},{"$f":"SUM(I36,K36)","v":0},{"$f":"H35*I16/7","v":0},{"$f":"I35*$I$16/7","v":0},{"$f":"J35*$K$16/7","v":0},{"$f":"K35*$K$16/7","v":0},{"$f":"SUM(L23:L33)","v":0},{"$f":"SUM(M23:M33)","v":0},{"$f":"SUM(N23:N33)","v":0},null,null,"Winter analog"]
[null,{"$f":"Text!$A$51","v":"Résidus de fourrage"},null,"%",5," 5 %"]
[null,{"$f":"Text!$A$53","v":"Volume des réserves de silo"},null,"%",10,"10 %",null,null,null,null,{"$f":"Text!$A$55","v":"Besoins d'espaces stockage en cas de fluctuations de rendement"}]
[null,{"$f":"Text!$A$56","v":"Pertes conservation "},null,"%",10]
[null,{"$f":"Text!$A$57","v":"Quantité de fourrage calculé"},null,{"$f":"D35","v":"kg MS"},{"$f":"E35","v":"kg par semaine"},{"$f":"F41/$G$17","v":0},{"$f":"G41/$G$17","v":0},{"$f":"H35*(1+SUM($E$37:$E$39)/100)","v":0},{"$f":"I35*(1+SUM($E$37:$E$39)/100)","v":0},{"$f":"J35*(1+SUM($E$37:$E$39)/100)","v":0},{"$f":"K35*(1+SUM($E$37:$E$39)/100)","v":0}]
{"$rows_left_out":48}
{"sheet":"Lists","index":4,"n_rows":121,"n_cols":4,"rows_kept":121,"cut":false,"hidden":true,"merged":[]}
[]
[null,{"$f":"Text!idx_lan","v":2}]
[null,"Used","Deutsch","Francais"]
["lst_cond",{"$f":"IF(idx_lan = 1,C4,IF(idx_lan = 2,D4,0))","v":"bon"},"gut","bon"]
[null,"moyen","mittel","moyen"]
[null,"mauvais","schlecht","mauvais"]
[null,0]
[null,0]
["lst_cornsil","< 30 % MS","< 30 % TS","< 30 % MS"]
[null,"30 - 35 % MS","30 - 35 % TS","30 - 35 % MS"]
[null,"> 35 % MS","> 35 % TS","> 35 % MS"]
[null,0]
["lst_grassil","< 25 % MS","< 25 % TS","< 25 % MS"]
[null,"25 - 35 % MS","25 - 35 % TS","25 - 35 % MS"]
[null,"> 35 % MS","> 35 % TS","> 35 % MS"]
[]
["lst_tab",{"$f":"IF(idx_lan = 1,C17,IF(idx_lan = 2,D17,0))","v":"Calcul"},"Berechnung","Calcul"]
[null,{"$f":"IF(idx_lan = 1,C18,IF(idx_lan = 2,D18,0))","v":"Compactage et avancement"},"Verdichtung und Vorschub","Compactage et avancement"]
[null,{"$f":"IF(idx_lan = 1,C19,IF(idx_lan = 2,D19,0))","v":"Autres informations"},"Weitere Informationen","Autres informations"]
[]
[]
[]
["lst_d",2.5]
["Silodurchmesser",3]
[null,3.5]
[null,4]
[null,4.5]
[null,5]
[null,5.5]
[null,6]
[null,6.5]
[null,7]
[null,7.5]
[null,8]
[null,8.5]
[null,9]
[null,9.5]
[null,10]
[]
["lst_h",10]
{"$rows_left_out":82}
{"sheet":"Text","index":5,"n_rows":997,"n_cols":11,"rows_kept":997,"cut":false,"hidden":true,"merged":[]}
[2]
[]
[]
[null,null,null,null,null,null,"check or"]
["Publish","Deutsch","Francais","Francais - sans Abréviation",null,"abbreviate","translate","look","compair","explain","abbrev."]
[{"$f":"IF(idx_lan = 1,data_d,IF(idx_lan = 2,data_f,0))","v":"Planifier les dimensions du silo"},"Silo-Dimensionen planen","Planifier les dimensions du silo",null,null,null,null,null,{"$f":"IF(C6=D6,1,IF(D6=\"\",1,0))","v":1}]
["Variante","Variante","Variante",null,null,null,null,null,{"$f":"IF(C7=D7,1,IF(D7=\"\",1,0))","v":1}]
["Projet de construction","Bauprojekt","Projet de construction",null,null,null,null,null,1]
["No du projet","Projekt-Nr.","No du projet",null,null,null,null,null,1]
["Conseiller(ère) ","BeraterIn: Name, Tel.","Conseiller(ère) ",null,null,null,null,null,1]
["Désignation de l'exploitation","Betriebsbezeichnung","Désignation de l'exploitation",null,null,null,null,null,1]
["Nom, prénom","Name, Vorname","Nom, prénom",null,null,null,null,null,1]
["Rue, numéro ","Strasse, Haus-Nr.","Rue, numéro ",null,null,null,null,null,1,null,"Rue, no."]
["NPA, lieu","PLZ, Ort","NPA, lieu",null,null,null,null,null,1]
["Canton","Kanton","Canton",null,null,null,null,null,1]
["Téléphone","Telefon","Téléphone",null,null,null,null,null,1]
["Fax, e-mail","Fax, E-Mail","Fax, e-mail",null,null,null,null,null,1]
["Période estivale et hivernale en jours","Sommer- und Winterperiode in Tagen","Période estivale et hivernale en jours",null,null,null,null,null,1]
["Année","Jahr","Année",null,null,null,null,null,1]
["Eté","Sommer","Eté",null,null,null,null,null,1]
["Hiver","Winter","Hiver",null,null,null,null,null,1]
["Besoins fourrages de base","Grundfutterbedarf","Besoins fourrages de base",null,null,null,null,null,1]
["Besoins en ensilage","Silagebedarf","Besoins en ensilage",null,null,null,null,null,1]
["en été","im Sommer","en été",null,null,null,null,null,1]
["en hiver","im Winter","en hiver",null,null,null,null,null,1]
["durant toute l'année","im ganzen Jahr","durant toute l'année",null,null,null,null,null,1]
["Fourrage de base","Grundfutterver-","Fourrage de base",null,null,null,null,null,1]
["Ensilage d'herbe","Grassilage","Ensilage d'herbe",null,null,null,null,null,1]
["Ensilage de maïs","Maissilage","Ensilage de maïs",null,null,null,null,null,1]
["Part de fourrages de base","Anteil am Grundfutter","Part de fourrages de base",null,null,null,null,null,1]
["Animaux","Tiere","Animaux",null,null,null,null,null,1]
["Places","Plätze","Places",null,null,null,null,null,1]
["par animal en","zehr je Tier in","par animal en",null,null,null,null,null,1]
["kg MS","kg TS","kg MS",null,null,null,null,null,1]
["kg MS par jour","kg TS pro Tag","kg MS par jour",null,null,null,null,null,1]
["en %","in %","en %",null,null,null,null,null,1]
["Vaches laitières","Milchkühe ","Vaches laitières",null,null,null,null,null,1]
["en lactation","in Laktation","en lactation",null,null,null,null,null,1]
["non suitées","galt","non suitées",null,null,null,null,null,1]
["Gén. d'élevage","Jungvieh","Gén. d'élevage","Génisses d'élevage",null,1,null,null,0]
{"$rows_left_out":958}
{"sheet":"Dev","index":6,"n_rows":38,"n_cols":4,"rows_kept":38,"cut":false,"hidden":true,"merged":[]}
[]
[null,"Creating the French version"]
[null,"- to remember! -"]
[]
[null,"Contol all footers"]
[null,"Check and customise the file info"]
[null,"|Dev| Check and adjust if necessary"]
[null,"Save"]
[null,"Saye as … with general version name (main version)"]
[null,"Hide hidden rows and columns"]
[null,"Sheet protection with password on all visible sheets"]
[null,"Select start cells on all sheets"]
[null,"Hide |Dev|"]
[null,"Hide |Lists|"]
[null,"Save"]
[null,"Save as … with D version name"]
[null,"Fill in the initial assignment into the green cells"]
[null,"Copy the links directly into the worksheets, see ENTER FIX in |Text|"]
[null,"Hide |Text|"]
[null,"Activate |Info|"]
[null,"Save an close"]
[null,"Open main version"]
[null,"Save as … with F version name"]
[null,"Fill in 2 in language cell"]
[null,"Fill in the initial assignment into the green cells"]
[null,"Copy the links directly into the worksheets, see ENTER FIX in |Text|"]
[null,"Change tab names, see ENTER FIX in |Text|"]
[null,"Adjust all footers"]
[null,"Hide |Text|"]
[null,"Activate |Info|"]
[null,"Save an close"]
[null,"File info add D or F"]
[]
[]
["Date","Changes","by whom","Version"]
[null,"Initial version","DFE / BST / SGR","2.0"]
[null,"Corrections, text and design changes","DFE / BST / SGR","2.01"]
["2024-10-04","French translation added","DFE / BST","2.1"]