{"text_format":"1","workbook":"xlsx","n_sheets":6,"sheets":["Info","Verdichtung und Vorschub","Bestimmung TS-Gehalt","Berechnung","Lists","Text"],"not_rendered":{"charts":0,"images":2,"macros":0,"external_links":0,"defined_names":26,"comments":0,"pivot_tables":0},"unopened":[],"bounds":{"document_bytes":16777216,"sheet_cells":100000,"rows_first":2000,"rows_last":500,"rows_between":2000,"halvings":0,"cell_chars":16384,"cell_head_chars":4096},"cells_cut":0,"cells_raw":0,"read":"whole","date_system":"1900"}

{"sheet":"Info","index":0,"n_rows":62,"n_cols":4,"rows_kept":62,"cut":false,"hidden":false,"merged":[]}
[]
[]
[]
[]
[null,{"$f":"Text!A187","v":"Erläuterungen SiloDim"}]
[null,{"$f":"Berechnung!K3","v":"Version 2.01"}]
[null,{"$f":"Berechnung!J3","v":0}]
[null,{"$f":"Text!A188","v":"Basis dieses Berechnungstools ist das Merkblatt «Dimensionierung von Gärfuttersilos», Version März 2024"}]
[null,{"$f":"Text!A186","v":"https://url.agridea.ch/SiloDim"}]
[null,{"$f":"Text!A185","v":"Links sind im Tool als Text eingefügt, um einen reibungslosen Download zu gewährleisten und Einschränkungen durch "}]
[null,{"$f":"Text!A184","v":"zusätzliche Sicherheitsabfragen zu vermeiden. Kopieren Sie den Link in Ihren Browser, um zum Merkblatt zu gelangen."}]
[]
[null,{"$f":"Text!A189","v":"Die Zellen im Blatt «Berechnung» sind mit unterschiedlichen Farben hinterlegt:"}]
[null,{"$f":"Text!A190","v":"Weiss"},"=",{"$f":"Text!A191","v":"fix vorgegebene Werte oder Text"}]
[null,{"$f":"Text!A192","v":"Gelb"},"=",{"$f":"Text!A193","v":"Zellen, in denen die Eingaben frei wählbar sind oder geändert werden können"}]
[null,{"$f":"Text!A194","v":"Grün"},"=",{"$f":"Text!A195","v":"beim Auswählen der Zelle erscheint rechts ein Kästchen mit einem Pfeil"}]
[null,null,null,{"$f":"Text!A196","v":"nach dem Anklicken des Pfeils kann der Wert aus der Liste ausgewählt werden"}]
[]
[null,{"$f":"Text!A197","v":"Blauer Text:"},null,{"$f":"Text!A198","v":"In diesem Bereich können Planungsvarianten zur Dimensionen der Siloanlage gerechnet werden,"}]
[null,null,null,{"$f":"Text!A209","v":"mit konkreten Eingaben."}]
[]
[null,"Bildschirmansicht"]
[null,{"$f":"Text!A181","v":"Die Ansicht im Blatt «Berechnung» ist optimiert auf die Anzeige auf einem PC-Bildschirm. "}]
[null,{"$f":"Text!A182","v":"Sollten Beschriftungen abgeschnitten sein, verändern Sie den Zoom-Faktor mit dem Schieber unten rechts oder"}]
[null,{"$f":"Text!A183","v":"über Menü [Ansicht] > Zoom - «benutzerdefiniert», um die beste Einstellung für ihr System zu finden. "}]
[]
[null,{"$f":"Text!A199","v":"Ermittlung Futterbedarf"}]
[null,{"$f":"Text!A200","v":"Der Futterbedarf soll aufgrund der betriebsspezifischen Fütterungsplanung eingegeben werden.  "}]
[null,{"$f":"Text!A201","v":"Der Bedarf für Sommer- und Winterfütterung wird separat dargestellt, da sich die Rationen meist erheblich unterscheiden,"}]
[null,{"$f":"Text!A202","v":"beispielsweise durch den Weideanteil."}]
[null,{"$f":"Text!A203","v":"Die vorgeschlagenen Werte rechts neben der Tabelle «Grundfutterbedarf» stammen aus dem AGRIDEA Betvor bzw. aus den GRUD."}]
[null,{"$f":"Text!A204","v":"Diese Werte sind jedoch je nach effektivem Leistungsniveau und den Erfahrungswerten aus dem Fütterungsplan anzupassen."}]
[]
[null,{"$f":"Text!A205","v":"Futterrest"}]
[null,{"$f":"Text!A206","v":"Für den %-Anteil des Futterrestes soll der individuelle Erfahrungswert des Betriebes erfasst werden."}]
[]
[null,{"$f":"Text!A207","v":"Volumen für Siloreserven"}]
[null,{"$f":"Text!A208","v":"Dieser Wert wird gemäss der auf dem Betrieb regelmässig zu erwartenden Ertragsschwankungen festgelegt."}]
[]
[null,{"$f":"Text!A210","v":"Ermittlung Lagerraumbedarf"}]
{"$rows_left_out":23}
{"sheet":"Verdichtung und Vorschub","index":1,"n_rows":24,"n_cols":6,"rows_kept":24,"cut":false,"hidden":false,"merged":[]}
[]
[null,{"$f":"Text!$A$128","v":"Werte zur Einschätzung der Silierbedingungen"}]
[]
[null,{"$f":"Text!A129","v":"zur Verdichtung bei der Entnahme von Silagen"}]
[]
[null,{"$f":"Text!$A$131","v":"Silierbedingungen"},null,{"$f":"Lists!B4","v":"gut"},{"$f":"Lists!B5","v":"mittel"},{"$f":"Lists!B6","v":"schlecht"}]
[null,{"$f":"Text!$A$132","v":"Verdichtung"},null,{"$f":"Text!$A$133","v":"kg TS / m³"},{"$f":"D7","v":"kg TS / m³"},{"$f":"D7","v":"kg TS / m³"}]
[null,{"$f":"Text!$A$134","v":"Gras"},{"$f":"Lists!B13","v":"< 25 % TS"},190,170,150]
[null,{"$f":"B8","v":"Gras"},{"$f":"Lists!B14","v":"25 - 35 % TS"},210,190,170]
[null,{"$f":"B8","v":"Gras"},{"$f":"Lists!B15","v":"> 35 % TS"},230,210,190]
[]
[null,{"$f":"Text!$A$135","v":"Mais"},{"$f":"Lists!B9","v":"< 30 % TS"},230,210,190]
[null,{"$f":"B12","v":"Mais"},{"$f":"Lists!B10","v":"30 - 35 % TS"},250,230,200]
[null,{"$f":"B12","v":"Mais"},{"$f":"Lists!B11","v":"> 35 % TS"},270,250,220]
[]
[null,{"$f":"Text!A123","v":"Ausgehend von den oben genannten Verdichtungswerten ergeben sich untenstehende Werte"}]
[null,{"$f":"Text!A130","v":"zum Vorschub bei der Entnahme von Silagen."}]
[]
[null,{"$f":"Text!$A$136","v":"Vorschub"},null,{"$f":"Text!A126","v":"m / Woche"},{"$f":"D19","v":"m / Woche"},{"$f":"D19","v":"m / Woche"}]
[null,{"$f":"Text!$A$137","v":"Winter"},null,{"$f":"Text!$A$138","v":"< 0.75"},{"$f":"Text!$A$139","v":"0.75 - 1.5"},{"$f":"Text!$A$140","v":"> 1.5"}]
[null,{"$f":"Text!$A$141","v":"Sommer"},null,{"$f":"Text!$A$142","v":"< 1.5"},{"$f":"Text!$A$143","v":"1.5 - 2.5"},{"$f":"Text!$A$144","v":"> 2.5"}]
[]
[null,{"$f":"Text!$A$145","v":"Die genannten Zahlen sind zur Orientierung gedacht und nicht als starre Grenzen zu betrachten."}]
[null,{"$f":"Text!$A$146","v":"Quelle: dlg-Praxishandbuch Futter- und Substratkonzentrierung (2012), S. 96"}]

{"sheet":"Bestimmung TS-Gehalt","index":2,"n_rows":36,"n_cols":10,"rows_kept":36,"cut":false,"hidden":false,"merged":[]}
[]
[null,{"$f":"Text!A160","v":"Schätzung des Trockensubstanzgehaltes von Silagen mittels Handprobe"}]
[]
[null,{"$f":"Text!A154","v":"Grassilage"}]
[]
[null,{"$f":"Text!A156","v":"Winden Sie die Probe wie einen Waschlappen aus und fassen Sie dabei nicht nach (Strangprobe)."}]
[null,{"$f":"Text!A157","v":"Wenn die Silage sehr nass ist, drücken Sie eine Kugel davon in der Hand aus (Kugelprobe)."}]
[]
[null,{"$f":"Text!A151","v":"Probeart"},{"$f":"Text!A152","v":"Saftaustritt"},null,null,null,null,null,null,{"$f":"Text!A153","v":"TS-Gehalt"}]
[null,{"$f":"Text!A158","v":"Kugelprobe"},{"$f":"Text!$A$163","v":"Saftfluss bei leichtem Pressen"},null,null,null,null,null,null,{"$f":"Lists!B109","v":"< 20 %"}]
[null,{"$f":"Text!A158","v":"Kugelprobe"},{"$f":"Text!$A$164","v":"Saftfluss bei starkem Presse"},null,null,null,null,null,null,{"$f":"Lists!B110","v":"25 %"}]
[null,{"$f":"Text!A159","v":"Strangprobe"},{"$f":"Text!$A$165","v":"Nach dem Auswinden Saft zwischen den Fingern"},null,null,null,null,null,null,{"$f":"Lists!B111","v":"30 %"}]
[null,{"$f":"Text!A159","v":"Strangprobe"},{"$f":"Text!$A$166","v":"Nach dem Auswinden kein Saft zwischen den Fingern, aber feuchte Hände"},null,null,null,null,null,null,{"$f":"Lists!B112","v":"35 %"}]
[null,{"$f":"Text!A159","v":"Strangprobe"},{"$f":"Text!$A$167","v":"Nach dem Auswinden glänzen die Hände noch"},null,null,null,null,null,null,{"$f":"Lists!B113","v":"40 %"}]
[null,{"$f":"Text!A159","v":"Strangprobe"},{"$f":"Text!$A$168","v":"Nach dem Auswinden ein leichtes Feuchtegefühl"},null,null,null,null,null,null,{"$f":"Lists!B114","v":"45 %"}]
[null,{"$f":"Text!A159","v":"Strangprobe"},{"$f":"Text!$A$169","v":"Nach dem Auswinden sind die Hände komplett trocken"},null,null,null,null,null,null,{"$f":"Lists!B115","v":"> 45 %"}]
[]
[null,{"$f":"Text!A170","v":"aus Merkblatt  \"Schlüssel zur Beurteilung der Grassilage-Qualität\" der Arbeitsgemeinschaft zur Förderung des Futterbaues (AGFF-K3b)"}]
[]
[null,{"$f":"Text!A155","v":"Maissilage"}]
[]
[null,{"$f":"Text!A171","v":"Nehmen Sie von der Maissilage soviel in die Hand, dass die Hand danach nicht vollständig geschlossen ist. Drücken Sie anschliessend "}]
[null,{"$f":"Text!A172","v":"auf die Maissilage ohne zu Pressen. Beobachten Sie das Auftreten von Flüssigkeit oder Feuchtigkeit zwischen den Fingern."}]
[]
[null,{"$f":"C9","v":"Saftaustritt"},null,null,null,null,null,null,null,{"$f":"J9","v":"TS-Gehalt"}]
[null,{"$f":"Text!B173","v":"Saft fliesst deutlich sichtbar"},null,null,null,null,null,null,null,{"$f":"Lists!B117","v":"< 30 %"}]
[null,{"$f":"Text!B174","v":"Es fliesst ein wenig Saft"},null,null,null,null,null,null,null,{"$f":"Lists!B118","v":"30 - 32 %"}]
[null,{"$f":"Text!B175","v":"Es tritt etwas Feuchtigkeit zwischen den Fingern auf, aber es tropft nicht"},null,null,null,null,null,null,null,{"$f":"Lists!B119","v":"32 - 36 %"}]
[null,{"$f":"Text!B176","v":"Es ist noch ein wenig Feuchtigkeit fühlbar"},null,null,null,null,null,null,null,{"$f":"Lists!B120","v":"36 - 38 %"}]
[null,{"$f":"Text!B177","v":"Es ist keine Feuchtigkeit mehr fühlbar"},null,null,null,null,null,null,null,{"$f":"Lists!B121","v":"> 38 %"}]
[]
[null,{"$f":"Text!B178","v":"aus Merkblatt  \"Schlüssel zur Beurteilung der Maissilage-Qualität\" der Arbeitsgemeinschaft zur Förderung des Futterbaues (AGFF-K3c)"}]
[]
[null,{"$f":"Text!A233","v":"Rumiplan "}]
[null,{"$f":"Text!A235","v":"https://www.barto.ch/de/bausteine/uebersicht/rumiplan-370"}]
[null,{"$f":"Text!A234","v":"Link in Textform: Kopieren Sie den Link in Ihren Browser, um zum Rumiplan zu gelangen."}]

{"sheet":"Berechnung","index":3,"n_rows":87,"n_cols":27,"rows_kept":87,"cut":false,"hidden":false,"merged":[]}
[]
[]
[null,null,null,null,null,null,null,null,null,null,{"$f":"Text!$A$111","v":"Version 2.01"}]
[null,{"$f":"Text!$A$10","v":"Silo-Dimensionen planen"}]
[null,null,null,null,null,null,null,{"$f":"Text!$A$11","v":"Variante"}]
[null,{"$f":"Text!$A$12","v":"Bauprojekt"},null,null,null,null,null,{"$f":"Text!$A$13","v":"Projekt-Nr."}]
[null,{"$f":"Text!$A$14","v":"BeraterIn: Name, Tel."}]
[]
[null,{"$f":"Text!$A$15","v":"Betriebsbezeichnung"}]
[null,{"$f":"Text!$A$16","v":"Name, Vorname"}]
[null,{"$f":"Text!$A$17","v":"Strasse, Haus-Nr."}]
[null,{"$f":"Text!$A$18","v":"PLZ, Ort"},null,null,null,null,null,{"$f":"Text!$A$19","v":"Kanton"}]
[null,{"$f":"Text!$A$20","v":"Telefon"},null,null,null,null,null,{"$f":"Text!$A$21","v":"Fax, E-Mail"}]
[]
[null,null,null,null,null,null,null,null,null,null,{"$f":"IF(L15=1,Text!A56,\"\")","v":""},{"$f":"IF(AND(SUM(H23:I33)>0,I16=0),1,0)","v":0}]
[null,{"$f":"Text!$A$22","v":"Sommer- und Winterperiode in Tagen"},null,null,null,{"$f":"Text!$A$23","v":"Jahr"},365,{"$f":"Text!$A$24","v":"Sommer"},null,{"$f":"Text!$A$25","v":"Winter"},{"$f":"G16-I16","v":365},null,null,null,null,null,"Grundannahmen, für produktive Version wieder entfernen"]
[null,null,null,null,null,null,{"$f":"G$16/7","v":52.142857142857146},null,{"$f":"I$16/7","v":0},null,{"$f":"K$16/7","v":52.142857142857146}]
[null,{"$f":"Text!$A$26","v":"Grundfutterbedarf"},null,null,null,{"$f":"Text!$A$27","v":"Silagebedarf"},null,{"$f":"Text!$A$28","v":"im Sommer"},null,{"$f":"Text!$A$29","v":"im Winter"}]
[null,null,null,null,null,{"$f":"Text!$A$30","v":"im ganzen Jahr"},null,{"$f":"F21","v":"Grassilage"},{"$f":"G21","v":"Maissilage"},{"$f":"F21","v":"Grassilage"},{"$f":"G21","v":"Maissilage"}]
[null,null,null,null,{"$f":"Text!$A$31","v":"Grundfutterver-"},null,null,{"$f":"Text!$A$34","v":"Anteil am"},{"$f":"H20","v":"Anteil am"},{"$f":"H20","v":"Anteil am"},{"$f":"H20","v":"Anteil am"},"werden später wieder entfernt"]
[null,{"$f":"Text!$A$35","v":"Tiere"},null,{"$f":"Text!$A$36","v":"Plätze"},{"$f":"Text!$A$37","v":"zehr je Tier in"},{"$f":"Text!$A$32","v":"Grassilage"},{"$f":"Text!$A$33","v":"Maissilage"},{"$f":"Text!$A$38","v":"Grundfutter"},{"$f":"H21","v":"Grundfutter"},{"$f":"H21","v":"Grundfutter"},{"$f":"H21","v":"Grundfutter"},"Gras- und Mais-","Restliches Grund-","GrundfutterVZ",null,null,"Der Grundfutterverzehr wird in TS angegeben."]
[null,null,null,null,{"$f":"Text!$A$39","v":"kg TS pro Tag"},null,null,{"$f":"Text!$A$40","v":"in %"},{"$f":"H22","v":"in %"},{"$f":"H22","v":"in %"},{"$f":"H22","v":"in %"},"silage in kg TS","futter in kg TS","Jahr gesamt in kg TS",null,null,"Anteil am Grundfutter:"]
[null,{"$f":"Text!$A$41","v":"Milchkühe "},{"$f":"Text!$A$42","v":"in Laktation"},null,{"$f":"IF(D23>0,AA23,0)","v":0},{"$f":"$D23*$E23*(H23*$I$16 + J23*$K$16)/100","v":0},{"$f":"$D23*$E23*(I23*$I$16 + K23*$K$16)/100","v":0},null,null,null,null,{"$f":"F23+G23","v":0},{"$f":"N23-L23","v":0},{"$f":"D23*E23*365","v":0},null,null,"Aufteilung in Grassilage, Maissilage, Rest ",null,null,null,null,null,null,null,null,null,15.6]
[null,{"$f":"B23","v":"Milchkühe "},{"$f":"Text!$A$43","v":"galt"},null,0,{"$f":"$D24*$E24*(H24*$I$16 + J24*$K$16)/100","v":0},{"$f":"$D24*$E24*(I24*$I$16 + K24*$K$16)/100","v":0},null,null,null,null,{"$f":"F24+G24","v":0},{"$f":"N24-L24","v":0},0,null,null,"im Rest sind alle anderen Grundfutter berücksichtigt,",null,null,null,null,null,null,null,null,null,11.1]
[null,{"$f":"Text!$A$44","v":"Jungvieh"},{"$f":"Text!$A$45","v":"bis 1 Jahr"},null,0,0,0,null,null,null,null,0,0,0,null,null,"einschliesslich Weideanteil",null,null,null,null,null,null,null,null,null,3]
[null,{"$f":"B25","v":"Jungvieh"},{"$f":"Text!$A$46","v":"1 bis 2 Jahre"},null,0,0,0,null,null,null,null,0,0,0,null,null,"Hier wird nur noch ein getragen, wieviel % an Silage gefüttert werden",null,null,null,null,null,null,null,null,null,7.1]
[null,{"$f":"B25","v":"Jungvieh"},{"$f":"Text!$A$47","v":"über 2 Jahre"},null,0,0,0,null,null,null,null,0,0,0,null,null,"das bedeutet:",null,null,null,null,null,null,null,null,null,9]
[null,{"$f":"Text!$A$48","v":"Rindviehmast"},{"$f":"Text!$A$49","v":"bis 160 Tage"},null,0,0,0,null,null,null,null,0,0,0,null,null,"Summe Gras- und Maissilage < 100 %",null,null,null,null,null,null,null,null,null,3.85]
[null,{"$f":"B28","v":"Rindviehmast"},{"$f":"Text!$A$50","v":"über 160 Tage"},null,0,0,0,null,null,null,null,0,0,0,null,null,"und maximal 100 % (nur eine Art von Silage und NICHTS ANDERES)",null,null,null,null,null,null,null,null,null,5.6]
[null,null,null,null,null,0,0,null,null,null,null,0,0,0,null,null,null,null,null,null,null,null,null,null,null,null,3.83]
[null,null,null,null,null,0,0,null,null,null,null,0,0,0]
[null,null,null,null,null,0,0,null,null,null,null,0,0,0]
[null,null,null,null,null,0,0,null,null,null,null,0,0,0]
[]
[null,{"$f":"Text!$A$51","v":"Errechneter TS-Verzehr"},null,{"$f":"Text!$A$52","v":"kg TS"},{"$f":"Text!$A$53","v":"pro Woche"},{"$f":"F36/$G$17","v":0},{"$f":"G36/$G$17","v":0},{"$f":"SUMPRODUCT($E23:$E33,H23:H33,$D23:$D33)*7/100","v":0},{"$f":"SUMPRODUCT($E23:$E33,I23:I33,$D23:$D33)*7/100","v":0},{"$f":"SUMPRODUCT($E23:$E33,J23:J33,$D23:$D33)*7/100","v":0},{"$f":"SUMPRODUCT($E23:$E33,K23:K33,$D23:$D33)*7/100","v":0},{"$f":"L36/$G$17","v":0},{"$f":"M36/$G$17","v":0},{"$f":"N36/$G$17","v":0},null,null,"Faktor Sommertage / 365 in Formel, da Eingabe Ganzjahresplätze"]
[null,null,null,null,{"$f":"Text!$A$54","v":"pro Jahr"},{"$f":"SUM(H36,J36)","v":0},{"$f":"SUM(I36,K36)","v":0},{"$f":"H35*I16/7","v":0},{"$f":"I35*$I$16/7","v":0},{"$f":"J35*$K$16/7","v":0},{"$f":"K35*$K$16/7","v":0},{"$f":"SUM(L23:L33)","v":0},{"$f":"SUM(M23:M33)","v":0},{"$f":"SUM(N23:N33)","v":0},null,null,"Winter analog"]
[null,{"$f":"Text!$A$55","v":"Futterrest"},null,"%",5," 5 %"]
[null,{"$f":"Text!$A$57","v":"Volumen für Siloreserven"},null,"%",10,"10 %",null,null,null,null,{"$f":"Text!$A$59","v":"zur Sicherstellung des Lagerraumbedarfs bei witterungsbedingten Ertragsschwankungen"}]
[null,{"$f":"Text!$A$60","v":"Konservierungsverlust"},null,"%",15]
[null,{"$f":"Text!$A$61","v":"Errechnete Futtermenge"},null,{"$f":"D35","v":"kg TS"},{"$f":"E35","v":"pro Woche"},{"$f":"F41/$G$17","v":0},{"$f":"G41/$G$17","v":0},{"$f":"H35*(1+SUM($E$37:$E$39)/100)","v":0},{"$f":"I35*(1+SUM($E$37:$E$39)/100)","v":0},{"$f":"J35*(1+SUM($E$37:$E$39)/100)","v":0},{"$f":"K35*(1+SUM($E$37:$E$39)/100)","v":0}]
{"$rows_left_out":48}
{"sheet":"Lists","index":4,"n_rows":121,"n_cols":4,"rows_kept":121,"cut":false,"hidden":true,"merged":[]}
[]
[null,{"$f":"Text!idx_lan","v":1}]
[null,"Used","Deutsch","Francais"]
["lst_cond",{"$f":"IF(idx_lan = 1,C4,IF(idx_lan = 2,D4,0))","v":"gut"},"gut"]
[null,"mittel","mittel"]
[null,"schlecht","schlecht"]
[null,0]
[null,0]
["lst_cornsil","< 30 % TS","< 30 % TS"]
[null,"30 - 35 % TS","30 - 35 % TS"]
[null,"> 35 % TS","> 35 % TS"]
[null,0]
["lst_grassil","< 25 % TS","< 25 % TS"]
[null,"25 - 35 % TS","25 - 35 % TS"]
[null,"> 35 % TS","> 35 % TS"]
[]
["lst_tab",{"$f":"IF(idx_lan = 1,C17,IF(idx_lan = 2,D17,0))","v":"Berechnung"},"Berechnung"]
[null,{"$f":"IF(idx_lan = 1,C18,IF(idx_lan = 2,D18,0))","v":"Verdichtung und Vorschub"},"Verdichtung und Vorschub"]
[null,{"$f":"IF(idx_lan = 1,C19,IF(idx_lan = 2,D19,0))","v":"Weitere Informationen"},"Weitere Informationen"]
[]
[]
[]
["lst_d",2.5]
["Silodurchmesser",3]
[null,3.5]
[null,4]
[null,4.5]
[null,5]
[null,5.5]
[null,6]
[null,6.5]
[null,7]
[null,7.5]
[null,8]
[null,8.5]
[null,9]
[null,9.5]
[null,10]
[]
["lst_h",10]
{"$rows_left_out":82}
{"sheet":"Text","index":5,"n_rows":1001,"n_cols":6,"rows_kept":1001,"cut":false,"hidden":true,"merged":[]}
[]
[]
[]
[]
[1]
[]
[]
[]
[null,"Deutsch","Francais"]
[{"$f":"IF(idx_lan = 1,data_d,IF(idx_lan = 2,data_f,0))","v":"Silo-Dimensionen planen"},"Silo-Dimensionen planen"]
["Variante","Variante"]
["Bauprojekt","Bauprojekt"]
["Projekt-Nr.","Projekt-Nr."]
["BeraterIn: Name, Tel.","BeraterIn: Name, Tel."]
["Betriebsbezeichnung","Betriebsbezeichnung"]
["Name, Vorname","Name, Vorname"]
["Strasse, Haus-Nr.","Strasse, Haus-Nr."]
["PLZ, Ort","PLZ, Ort"]
["Kanton","Kanton"]
["Telefon","Telefon"]
["Fax, E-Mail","Fax, E-Mail"]
["Sommer- und Winterperiode in Tagen","Sommer- und Winterperiode in Tagen"]
["Jahr","Jahr"]
["Sommer","Sommer"]
["Winter","Winter"]
["Grundfutterbedarf","Grundfutterbedarf"]
["Silagebedarf","Silagebedarf"]
["im Sommer","im Sommer"]
["im Winter","im Winter"]
["im ganzen Jahr","im ganzen Jahr"]
["Grundfutterver-","Grundfutterver-"]
["Grassilage","Grassilage"]
["Maissilage","Maissilage"]
["Anteil am","Anteil am"]
["Tiere","Tiere"]
["Plätze","Plätze"]
["zehr je Tier in","zehr je Tier in"]
["Grundfutter","Grundfutter"]
["kg TS pro Tag","kg TS pro Tag"]
["in %","in %"]
{"$rows_left_out":961}