{"text_format":"1","workbook":"xlsx","n_sheets":41,"sheets":["Q","Dblatt","Info","Inv","A1a","A1b","A1c","A1d","A1e","A2a","A2b","A2c","A2d","A2e","B1","B2","B3","B4","BX1","BX2","BX3","BX4","B5","BX5","B6","B7","Impex","Plausi","Poulet1","Poulet2","Poulet3","Poulet_tot","Reserve","Faktoren","Textes","Corr","Dialog_Blatt","Dialog_Drucken","M_Vars","M_Zeilen","M_Util"],"not_rendered":{"charts":0,"images":2,"macros":1,"external_links":0,"defined_names":334,"comments":0,"pivot_tables":0},"unopened":[{"sheet":"Dialog_Blatt","index":36,"reason":"not_a_worksheet"},{"sheet":"Dialog_Drucken","index":37,"reason":"not_a_worksheet"},{"sheet":"M_Vars","index":38,"reason":"part_missing"},{"sheet":"M_Zeilen","index":39,"reason":"part_missing"},{"sheet":"M_Util","index":40,"reason":"part_missing"}],"bounds":{"document_bytes":16777216,"sheet_cells":100000,"rows_first":2000,"rows_last":500,"rows_between":2000,"halvings":0,"cell_chars":16384,"cell_head_chars":4096},"cells_cut":0,"cells_raw":0,"read":"whole","date_system":"1900"}

{"sheet":"Q","index":0,"n_rows":90,"n_cols":7,"rows_kept":90,"cut":false,"hidden":true,"merged":[]}
[]
["Versions-Nummer:","Impex",2.12,"2023-01-31"]
[null,"Finished",1]
[null,"Language",{"$f":"Textes!SprachIdx","v":1}]
["BlattRef:",null,null,null,"Menüs"]
[{"$f":"Dblatt!B16","v":"Table des matières"},null,null,null,{"$f":"IF($C$4=1,F6,IF($C$4=2,G6,IF($C$4=3,D39,\"\")))","v":"Li&gnes"},"Li&gnes","&Zeilen"]
[{"$f":"Info!L1","v":"Mode d'emploi"},null,null,null,"a&jouter une ligne","a&jouter une ligne","Zeile &einfügen"]
[{"$f":"Inv!K1","v":"Inventaire début et fin"},null,null,null,"ajouter &plusieurs lignes","ajouter &plusieurs lignes","&Mehrere Zeilen einfügen"]
[{"$f":"A1a!$K$6","v":"Entrée animaux"},null,null,null,"e&ffacer les lignes sélectionnées","e&ffacer les lignes sélectionnées","Markierte Zeilen &löschen"]
[{"$f":"A1b!$K$6","v":"Entrée animaux"},null,null,null,"&découper les lignes sélectionnées","&découper les lignes sélectionnées","Markierte Zeilen &ausschneiden"]
[{"$f":"A1c!$K$6","v":"Entrée animaux"},null,null,null,"d&écaler les lignes découpées","d&écaler les lignes découpées","Ausgeschnittene Zeilen &verschieben"]
[{"$f":"A1d!$K$6","v":"Entrée animaux"},null,null,null,"&Feuilles","&Feuilles","Tabe&llenblätter"]
[{"$f":"A1e!$K$6","v":"Entrée animaux"},null,null,null,"c&hoisir","c&hoisir","&auswählen"]
[{"$f":"A2a!$K$8","v":"Sortie animaux"},null,null,null,"im&primer","im&primer","&drucken"]
[{"$f":"A2b!$K$8","v":"Sortie animaux"},null,null,null,"Data &importer","Data &importer","Daten&import"]
[{"$f":"A2c!$K$8","v":"Sortie animaux"},null,null,null,"&importer","&importer","Anfangs&bestand importieren"]
[{"$f":"A2d!$K$8","v":"Sortie animaux"},null,null,null,"&tester","&tester","&Testdaten importieren"]
[{"$f":"A2e!$K$8","v":"Sortie animaux"}]
[{"$f":"'B1'!$K$13","v":"Entrée aliments"},null,null,null,"Msg-Boxen"]
[{"$f":"'B2'!$K$13","v":"Entrée aliments"},null,null,null,{"$f":"IF($C$4=1,F20,IF($C$4=2,G20,IF($C$4=3,D45,\"\")))","v":"Vous ne pouvez pas sélectionner plusieurs cellules!"},"Vous ne pouvez pas sélectionner plusieurs cellules!","Mehrfachmarkierung nicht erlaubt!"]
[{"$f":"'B3'!$K$13","v":"Entrée aliments"},null,null,null,"Nombre de lignes","Nombre de lignes","Anzahl Zeilen"]
[{"$f":"'B4'!$K$13","v":"Entrée aliments"},null,null,null,"Ajouter des lignes","Ajouter des lignes","Zeilen einfügen"]
[{"$f":"'BX1'!$K$13","v":"Entrée aliments"},null,null,null,"Sur cette feuille vous ne pouvez pas ajouter des lignes !","Sur cette feuille vous ne pouvez pas ajouter des lignes !","Auf diesem Blatt können keine Zeilen eingefügt werden"]
[{"$f":"'BX2'!$K$13","v":"Entrée aliments"},null,null,null,"Choisissez une seule ligne !","Choisissez une seule ligne !","Zum Einfügen darf nur eine Zeile ausgewählt sein!"]
[{"$f":"'BX3'!$K$13","v":"Entrée aliments"},null,null,null,"Ici vous ne pouvez pas ajouter des lignes !","Ici vous ne pouvez pas ajouter des lignes !","Hier können keine Zeilen eingefügt werden!"]
[{"$f":"'BX4'!$K$13","v":"Entrée aliments"},null,null,null,"Sur cette feuille vous ne pouvez pas effacer des lignes !","Sur cette feuille vous ne pouvez pas effacer des lignes !","Auf diesem Blatt können keine Zeilen gelöscht werden"]
[{"$f":"'B5'!$K$11","v":"Entrée aliments"},null,null,null,"La position sélectionnée contient des lignes qui ne peuvent pas être effacées !","La position sélectionnée contient des lignes qui ne peuvent pas être effacées !","Der markierte Bereich enthält Zeilen, die nicht gelöscht werden dürfen!"]
[{"$f":"'BX5'!$K$11","v":"Entrée aliments"},null,null,null,"Sur cette feuille vous ne pouvez pas découper des lignes !","Sur cette feuille vous ne pouvez pas découper des lignes !","Auf diesem Blatt können keine Zeilen ausgeschnitten werden"]
[{"$f":"'B6'!$K$11","v":"Entrée aliments"},null,null,null,"La position sélectionnée contient des lignes qui ne peuvent pas être décalées !","La position sélectionnée contient des lignes qui ne peuvent pas être décalées !","Der markierte Bereich enthält Zeilen, die nicht verschoben werden dürfen!"]
[{"$f":"'B7'!$K$11","v":"Entrée aliments"},null,null,null,"Décaler ne peut pas être interrompu par une autre opération !","Décaler ne peut pas être interrompu par une autre opération !","Verschieben darf nicht durch eine andere Operation unterbrochen werden!"]
[{"$f":"Impex!L1","v":"Bilan import/export"},null,null,null,"Vous ne pouvez pas ajouter les lignes sur une autre feuille !","Vous ne pouvez pas ajouter les lignes sur une autre feuille !","Die Zeilen können nicht in ein anderes Blatt eingefügt werden!"]
[{"$f":"Plausi!K1","v":"Calcul des valeurs minimales"}]
[{"$f":"Poulet1!L2","v":"Poulailler 1"},null,null,null,{"$f":"IF($C$4=1,F33,IF($C$4=2,G33,IF($C$4=3,H33,\"\")))","v":"Ici vous ne pouvez pas ajouter les lignes découpées !"},"Ici vous ne pouvez pas ajouter les lignes découpées !","Hier können die ausgeschnittenen Zeilen nicht eingefügt werden!"]
[{"$f":"Poulet2!L2","v":"Poulailler 2"},null,null,null,"terminée le ","terminée le ","fertigestellt am "]
[{"$f":"Poulet3!L2","v":"Poulailler 3"},null,null,null,"Par cette action toutes les données","Par cette action toutes les données","Bei dieser Aktion werden alle in den Zielblättern"]
[{"$f":"Poulet_tot!H1","v":"Sommaire poulets"},null,null,null,"existantes dans les fiches cible seront écrasées !","existantes dans les fiches cible seront écrasées !","schon vorhandenen Daten überschrieben."]
[{"$f":"Reserve!A1","v":"Reserve"},null,null,null,"Voulez-vous continuer ?","Voulez-vous continuer ?","Wollen Sie fortfahren?"]
[{"$f":"Faktoren!E2","v":"Umrechnungsfaktoren"},null,null,null,"Mot de passe pas valable","Mot de passe pas valable","Passwort ungültig"]
[{"$f":"Textes!A1","v":"Texte"},null,null,null,"Attention","Attention","Warnung"]
[{"$f":"Corr!D1","v":"Anpassungen"},null,null,null,"Vous devez d'abord entrer le début et la fin de l'année de contrôle !","Vous devez d'abord entrer le début et la fin de l'année de contrôle !","Sie müssen zuerst den Beginn und Ende des Kontrolljahres eintragen!"]
[null,null,null,null,"La date début doit être le 1er janvier !","La date début doit être le 1er janvier !","Das Anfangsdatum muss der 1. Januar sein!"]
[null,null,null,null,"La date fin doit être le 31 décembre !","La date fin doit être le 31 décembre !","Das Enddatum muss der 31. Dezember sein!"]
["Blatt-Liste","lstBlattDisplay",null,null,"L'année de la date début et de date fin doit être la même !","L'année de la date début et de date fin doit être la même !","Das Jahr des Anfangs- und des Enddatums muss gleich sein!"]
[{"$f":"Info!L1","v":"Mode d'emploi"},{"$f":"$A$44 & \", Info\"","v":"Mode d'emploi, Info"},null,null,"Année de contrôle et année de la","Année de contrôle et année de la","Das Kontrolljahr und das Jahr"]
[{"$f":"Inv!K1","v":"Inventaire début et fin"},{"$f":"$A$45 & \", Inv\"","v":"Inventaire début et fin, Inv"},null,null,"rotation saisie ne correspondent pas !","rotation saisie ne correspondent pas !","der erfassten Umtriebe stimmen nicht überein!"]
[{"$f":"A1a!$K$6","v":"Entrée animaux"},{"$f":"$A$46 & \", A1a\"","v":"Entrée animaux, A1a"},null,null,"Indication","Indication","Hinweis"]
[{"$f":"A1b!$K$6","v":"Entrée animaux"},{"$f":"$A$47 & \", A1b\"","v":"Entrée animaux, A1b"},null,null,"page","page","Seite"]
[{"$f":"A1c!$K$6","v":"Entrée animaux"},{"$f":"$A$48 & \", A1c\"","v":"Entrée animaux, A1c"},null,null,"Table des matières","Table des matières","Inhaltsverzeichnis"]
[{"$f":"A1d!$K$6","v":"Entrée animaux"},{"$f":"$A$49 & \", A1d\"","v":"Entrée animaux, A1d"},null,null,"Cette action efface de manière irréversible toutes les données dans les lignes supplémentaires des aliments ! ","Cette action efface de manière irréversible toutes les données dans les lignes supplémentaires des aliments ! ","Bestehende Inhalte in den zusätzlichen Futtermittelzeilen werden unwiderruflich gelöscht! "]
[{"$f":"A1e!$K$6","v":"Entrée animaux"},{"$f":"$A$50 & \", A1e\"","v":"Entrée animaux, A1e"},null,null,"Veuillez enregistrer ce classeur sous un autre nom!","Veuillez enregistrer ce classeur sous un autre nom!","Bitte diese Mappe unter einem neuen Namen abspeichern!"]
[{"$f":"A2a!$K$8","v":"Sortie animaux"},{"$f":"$A$51 & \", A2a\"","v":"Sortie animaux, A2a"},null,null,"Le nouveau nom ne doit contenir ni espaces ni signes particuliers (p.ex. .,:/&)!","Le nouveau nom ne doit contenir ni espaces ni signes particuliers (p.ex. .,:/&)!","Der neue Name darf keine Leerschläge oder Sonderzeichen (z.B. .,:/& etc.) enthalten!"]
[{"$f":"A2b!$K$8","v":"Sortie animaux"},{"$f":"$A$52 & \", A2b\"","v":"Sortie animaux, A2b"},null,null,"Souhaitez-vous importer les données d'exploitation et le stock à partir d'un autre bilan d'importation/exportation ?","Souhaitez-vous importer les données d'exploitation et le stock à partir d'un autre bilan d'importation/exportation ?","Wollen Sie die Betriebsdaten und das Inventar aus einer anderen Import-/Exportbilanz importieren?"]
[{"$f":"A2c!$K$8","v":"Sortie animaux"},{"$f":"$A$53 & \", A2c\"","v":"Sortie animaux, A2c"},null,null,"IMPORTATION DES DONNÉES","IMPORTATION DES DONNÉES","DATENIMPORT"]
[{"$f":"A2d!$K$8","v":"Sortie animaux"},{"$f":"$A$54 & \", A2d\"","v":"Sortie animaux, A2d"},null,null,{"$f":"IF($C$4=1,F54,IF($C$4=2,G54,IF($C$4=3,H54,\"\")))","v":"Il y a déjà des données, voulez-vous commencer l'importation de toute façon ?"},"Il y a déjà des données, voulez-vous commencer l'importation de toute façon ?","Es befinden sich bereits Daten in Ihrer Arbeitsmappe. Wollen Sie trotzdem Daten importieren? Achtung: Bestehende Inhalte werden dann unwiederruflich gelöscht!"]
[{"$f":"A2e!$K$8","v":"Sortie animaux"},{"$f":"$A$55 & \", A2e\"","v":"Sortie animaux, A2e"},null,null,"IMPORTATION DES DONNÉES?","IMPORTATION DES DONNÉES?","DATENIMPORT?"]
[{"$f":"'B1'!$K$13","v":"Entrée aliments"},{"$f":"$A$56 & \", B1\"","v":"Entrée aliments, B1"},null,null,"Importation des données terminée avec succès","Importation des données terminée avec succès","Die Daten wurden erfolgreich importiert."]
[{"$f":"'B2'!$K$13","v":"Entrée aliments"},{"$f":"$A$57 & \", B2\"","v":"Entrée aliments, B2"},null,null,"IMPORTATION des données TERMINÉE","IMPORTATION des données TERMINÉE","IMPORT ABGESCHLOSSEN"]
[{"$f":"'B3'!$K$13","v":"Entrée aliments"},{"$f":"$A$58 & \", B3\"","v":"Entrée aliments, B3"},null,null,"Veuillez enregistrer ce classeur sous un autre nom!","Veuillez enregistrer ce classeur sous un autre nom!","Wollen Sie diese Mappe unter einem neuen Namen abspeichern?"]
[{"$f":"'B4'!$K$13","v":"Entrée aliments"},{"$f":"$A$59 & \", B4\"","v":"Entrée aliments, B4"},null,null,"La version du fichier que vous voulez importer est trop ancienne.","La version du fichier que vous voulez importer est trop ancienne.","Die Version der Datei, die Sie importieren wollen, ist zu alt."]
[{"$f":"'B5'!$K$11","v":"Entrée aliments"},{"$f":"$A$60 & \", B5\"","v":"Entrée aliments, B5"},null,null,"Veuillez reprendre les données manuellement !","Veuillez reprendre les données manuellement !","Bitte übernehmen Sie die Daten manuell!"]
[{"$f":"'B6'!$K$11","v":"Entrée aliments"},{"$f":"$A$61 & \", B6\"","v":"Entrée aliments, B6"},null,null,"Veuillez entrer le mot de passe !","Veuillez entrer le mot de passe !","Bitte geben Sie das Passwort ein!"]
[{"$f":"'B7'!$K$11","v":"Entrée aliments"},{"$f":"$A$62 & \", B7\"","v":"Entrée aliments, B7"},null,null,"MOT DE PASSE","MOT DE PASSE","PASSWORT"]
[{"$f":"Impex!L1","v":"Bilan import/export"},{"$f":"$A$63 & \", Impex\"","v":"Bilan import/export, Impex"},null,null,"IMPORTATION IMPOSSIBLE","IMPORTATION IMPOSSIBLE","KEIN IMPORT MÖGLICH"]
[{"$f":"Plausi!K1","v":"Calcul des valeurs minimales"},{"$f":"$A$64 & \", Plausi\"","v":"Calcul des valeurs minimales, Plausi"},null,null,"Importation à partir de ce fichier impossible","Importation à partir de ce fichier impossible","Ein Import aus dieser Datei ist nicht möglich!"]
[{"$f":"Reserve!A1","v":"Reserve"},{"$f":"$A$65 & \", Reserve\"","v":"Reserve, Reserve"}]
[]
[]
[]
[]
[]
[]
[]
[]
[]
[]
[]
[]
[]
[]
[]
[]
[]
[]
["rngVersAreas","rngCtrl","rngReImp","rngExp"]
[2.6,"WENN(FuttermittelErweitert=FALSCH();0;1);Textes!$G$2;Textes!SprachIdx","Inv!$D$4:$D$9,Inv!$I$4:$I$9,Inv!$E$14:$E$22,Inv!$B$28:$I$59,Inv!$B$63:$I$70,Inv!$F$71:$F$72","Inv!$I$14:$J$22,Inv!$K$28:$K$59,Inv!$K$63:$K$72,Inv!$K$74,Inv!$K$75","rngImp"]
[2.7,"WENN(FuttermittelErweitert=FALSCH();0;1);Textes!$G$2;Textes!SprachIdx","Inv!$D$4:$D$9,Inv!$I$4:$I$9,Inv!$E$14:$E$22,Inv!$B$28:$I$59,Inv!$B$63:$I$70,Inv!$F$72:$F$73","Inv!$I$14:$J$22,Inv!$K$28:$K$59,Inv!$K$63:$K$74,Inv!$K$77,Inv!$K$78","Inv!$F$14:$G$22,Inv!$J$28:$J$59,Inv!$J$63:$J$72,Inv!$J$74,Inv!$J$75"]
[2.8,"WENN(FuttermittelErweitert=FALSCH();0;1);Textes!$G$2;Textes!SprachIdx","Inv!$D$4:$D$9,Inv!$I$4:$I$9,Inv!$E$14:$E$22,Inv!$B$28:$I$59,Inv!$B$64:$I$71,Inv!$F$72:$F$73","Inv!$I$14:$J$22,Inv!$K$28:$K$59,Inv!$K$64:$K$75,Inv!$K$77,Inv!$K$78","Inv!$F$14:$G$22,Inv!$J$28:$J$59,Inv!$J$63:$J$74,Inv!$J$77,Inv!$J$78"]
[2.9,"rngCtrl","Inv!$D$4:$D$9,Inv!$I$4:$I$9,Inv!$E$14:$E$22,Inv!$B$28:$I$59,Inv!$B$64:$I$71,Inv!$F$72:$F$73","Inv!$I$14:$J$22,Inv!$K$28:$K$60,Inv!$K$64:$K$75,Inv!$K$77,Inv!$K$79,Inv!$K$78","Inv!$F$14:$G$22,Inv!$J$28:$J$59,Inv!$J$64:$J$75,Inv!$J$77,Inv!$J$78"]
[null,"rngCtrl","rngReImp","rngExp","Inv!$F$14:$G$22,Inv!$J$28:$J$59,Inv!$J$64:$J$75,Inv!$J$77,Inv!$J$79,Inv!$J$78"]
[null,null,null,null,"rngImp"]

{"sheet":"Dblatt","index":1,"n_rows":28,"n_cols":7,"rows_kept":28,"cut":false,"hidden":true,"merged":[]}
[]
[null,null,null,null,null,null,"Impex"]
[]
[]
[null,{"$f":"Textes!A371","v":"No cantonal:"},null,{"$f":"Inv!StartZelle","v":0}]
[null,{"$f":"Textes!A372","v":"Exploitation:"},null,{"$f":"Inv!D6&\" \"&Inv!D5","v":" "}]
[null,{"$f":"Textes!A373","v":"Adresse:"},null,{"$f":"Inv!D7","v":0}]
[null,{"$f":"Textes!A374","v":"NPA, lieu:"},null,{"$f":"Inv!D9","v":0}]
[]
[null,{"$f":"Textes!A375","v":"Calculé par:"},null,{"$f":"Inv!I4","v":0}]
[null,{"$f":"Textes!A376","v":"Firme:"},null,{"$f":"Inv!I7","v":"00:00:00"}]
[null,{"$f":"Textes!A377","v":"No téléphone:"},null,{"$f":"Inv!J5","v":0}]
[]
[null,{"$f":"Textes!A378","v":"Période:"},null,{"$f":"Inv!DatumAnfang","v":"00:00:00"}," - ",{"$f":"Inv!DatumEnde","v":"00:00:00"}]
[]
[null,{"$f":"Textes!A370","v":"Table des matières"},null,null,null,null,{"$f":"Q!Seite","v":"page"}]
[]
[null,null,null,{"$f":"Textes!A370","v":"Table des matières"},null,null,1]
[null,null,null,"Tiereingang , A1a",null,null,2]
[null,null,null,"Mischfutterzufuhr, B1",null,null,3]
[null,null,null,"Mischfutterzufuhr, BX2",null,null,4]
[null,null,null,"Futterzufuhr, BX5",null,null,5]
[null,null,null,"Futterzufuhr, B6",null,null,6]
[null,null,null,"Futterzufuhr, B7",null,null,7]
[null,null,null,"Import/Exportbilanz, Impex",null,null,8]
[null,null,null,"Berechnung der Tiefstwerte, Plausi",null,null,9]
[null,null,null,"Stall 1, Poulet1",null,null,10]
[null,null,null,"Poulets Zusammenfassung, Poulet_tot",null,null,11]

{"sheet":"Info","index":2,"n_rows":89,"n_cols":12,"rows_kept":89,"cut":false,"hidden":false,"merged":[[17,3,17,4],[19,3,19,4]]}
[null,null,null,null,null,null,null,null,null,null,null,{"$f":"Textes!A379","v":"Mode d'emploi"}]
[]
[null,{"$f":"Textes!A381","v":"Table des matières"},null,null,null,null,null,null,null,null,null,{"$f":" Q!ProgrammTyp & \" \" &Textes!A380 & \": \" & Q!VersionsNummer","v":"Impex Version: 2.12"}]
[]
[null,{"$f":"Textes!A382","v":"1 Indications générales concernant l‘utilisation"}]
[null,{"$f":"Textes!A383","v":"2 Notes concernant le remplissage des tableaux"}]
[null,{"$f":"Textes!A384","v":"2a) Instructions pour les porcs, poulettes, dindes à l’engrais et lapins"}]
[null,{"$f":"Textes!A385","v":"2b) Instructions pour les exploitations ayant des poulets à l‘engrais"}]
[null,{"$f":"Textes!A386","v":"2c) Indications supplémentaires pour des exploitations ayant des poulets à l‘engrais extensif"}]
[]
[null,{"$f":"Textes!A387","v":"1 Indications générales concernant l‘utilisation"}]
[]
[null,null,{"$f":"Textes!A388","v":"Macros:"},{"$f":"Textes!A389","v":"Les macros doivent être autorisées."}]
[null,null,null,{"$f":"Textes!A390","v":"Si « poulets à l’engrais » apparaît automatiquement dans le tableau"}]
[null,null,null,{"$f":"Textes!A391","v":"Poulet1 lors du choix de l’espèce, les macros sont autorisées"}]
[null,null,null,{"$f":"Textes!A392","v":"=> Instructions en détail"},null,null,{"$f":"Textes!A393","v":"www.agridea.ch > Software > Downloads > Impex 2.12 > Instructions"}]
[]
[null,null,{"$f":"Textes!A394","v":"Saisie des données"},{"$f":"Textes!A395","v":"Cellules jaunes"},null,null,{"$f":"Textes!A396","v":"Selon les besoins, vous pouvez ici saisir du texte ou des chiffres"}]
[]
[null,null,null,{"$f":"Textes!A397","v":"Cellules blanches"},null,null,{"$f":"Textes!A398","v":"Ces cellules sont généralement bloquées à la saisie"}]
[]
[null,null,{"$f":"Textes!A399","v":"Imprimer:"},{"$f":"Textes!A400","v":"Excel 2007, 2010, 2013 ainsi que 2016: Choisissez le menu"}]
[null,null,null,{"$f":"Textes!A401","v":"« Compléments » et le sous-menu « Feuilles »"}]
[null,null,null,{"$f":"Textes!A402","v":"Excel 2003: Choisissiez le menu «Feuilles »"}]
[null,null,null,{"$f":"Textes!A403","v":"Lorsque vous choisissez le sous-menu « Imprimer », une liste de sélection apparait"}]
[null,null,null,{"$f":"Textes!A404","v":"dans laquelle une ou plusieurs feuilles de calcul peuvent être sélectionnées"}]
[null,null,null,{"$f":"Textes!A405","v":"par simple clic pour l'impression. Pour une sélection multiple, pressez Ctrl pendant le processus de sélection."}]
[null,null,null,{"$f":"Textes!A406","v":"En appuyant sur ce bouton toutes les feuilles seront sélectionnées."}]
[]
[null,null,{"$f":"Textes!A407","v":"Enregistrement du fichier:"},{"$f":"Textes!A408","v":"Attention : avec Excel 2007, 2010, 2013 ainsi que 2016: Sous « enregistrer sous »"}]
[null,null,null,{"$f":"Textes!A409","v":"vous devez choisir le type « fichier Excel avec macros » (.xlsm). "}]
[]
[null,{"$f":"Textes!A410","v":"2 Notes concernant le remplissage des tableaux"}]
[]
[null,null,{"$f":"Textes!A411","v":"Tenez tous les documents (listing des aliments, poids abattus…) à portée de main."}]
[null,null,{"$f":"Textes!A412","v":"Les virgules ne sont pas acceptées! Toutes les virgules et dates doivent être saisies avec des points (« . »)."}]
[]
[null,null,{"$f":"Textes!A413","v":"2a) Instructions concernant les porcs, poulettes, dindes et lapins"}]
[]
[null,null,{"$f":"Textes!A414","v":"1. Start au tableau Inv [=Inventaire]:"},null,{"$f":"Textes!A415","v":"Choisissez la langue, saisissez votre adresse, la période et la catégorie d’animaux"}]
[]
[null,null,{"$f":"Textes!A416","v":"2. Saisie des données sur les fiches suivantes (poulets à l’engrais => voir point 2b)"}]
[null,null,null,null,{"$f":"Textes!A417","v":"- De plus, sur  la fiche Inv: Inventaire des aliments et animaux"}]
[null,null,null,null,{"$f":"Textes!A418","v":"  Attention: Les saisies des teneurs des aliments doivent toujours être faites en g par kg !"}]
[null,null,null,null,{"$f":"Textes!A419","v":"- Fiche A1a-e: Toutes les entrées des animaux"}]
[null,null,null,null,{"$f":"Textes!A420","v":"- Fiche A2a-e: Toutes les sorties des animaux"}]
[null,null,null,null,{"$f":"Textes!A421","v":"  Porcs: Répartition des catégories d’animaux sur les différentes fiches"}]
[null,null,null,null,{"$f":"Textes!A422","v":"  et choix du rendement d’abattage concerné. Par exemple :"}]
[null,null,null,null,{"$f":"Textes!A423","v":"  A2a saisie des porcs à l’engrais, A2b truies mères échaudées, A2c truies mères dépouillées, etc."}]
[null,null,null,null,{"$f":"Textes!A424","v":"- Page B1-5: Tous les aliments"}]
[null,null,null,null,{"$f":"Textes!A425","v":"- Fiche Impex: Aperçu/résultats. Le bilan des animaux doit être égal à zéro."}]
[null,null,null,null,{"$f":"Textes!A426","v":"- Fiche Plausi: Saisie de l’effectif moyen et transfert de la production"}]
[null,null,null,null,{"$f":"Textes!A427","v":"  des éléments nutritifs dans le Suisse-Bilanz"}]
[]
[null,null,{"$f":"Textes!A428","v":"2b) Instructions pour les exploitations ayant des poulets à l‘engrais"}]
[]
[null,null,{"$f":"Textes!A429","v":"1. Start à la fiche Inv [Inventaire]:"},null,{"$f":"Textes!A430","v":"Choix de la langue, saisie de l’adresse et de la période."}]
[null,null,null,null,{"$f":"Textes!A431","v":"L’inventaire des animaux ne doit PAS être saisi."}]
[null,null,null,null,{"$f":"Textes!A432","v":"Choix de la catégorie « poulets à l’engrais » => transfert automatiquement vers Poulet1"}]
[]
[null,null,{"$f":"Textes!A433","v":"2. Fiches Poulet1, Poulet2, …:"},null,{"$f":"Textes!A434","v":"Saisissiez les dates et nombres de toutes les rotations."}]
[null,null,null,null,{"$f":"Textes!A435","v":"Attention : les rotations qui ont commencé avant la période"}]
[null,null,null,null,{"$f":"Textes!A436","v":"ou qui finissent après la période doivent être saisies entièrement."}]
[null,null,null,null,{"$f":"Textes!A437","v":"La délimitation de l’année s’effectue automatiquement."}]
[null,null,null,null,{"$f":"Textes!A438","v":"Si l’effectif moyen calculé est supérieur à 3‘000 poulets,"}]
[null,null,null,null,{"$f":"Textes!A439","v":"le poids vivant doit aussi être saisi ainsi qu’un bilan import/export complet calculé."}]
[null,null,null,null,{"$f":"Textes!A440","v":"Si l’effectif moyen calculé est inférieur à 3‘000 poulets,"}]
[null,null,null,null,{"$f":"Textes!A441","v":"le poids vivant ne doit pas être saisi."}]
[]
[null,null,{"$f":"Textes!A442","v":"3. Bouton de commande «Achat et"},null,{"$f":"Textes!A444","v":"transfert de toutes le entrées et sorties d’animaux dans les fiches A1a-c et A2a-c."}]
[null,null,{"$f":"Textes!A443","v":"    vente transférés dans A1c et A2c»:"},null,{"$f":"Textes!A445","v":"Attention : il faut d’abord saisir toutes les rotations."}]
[]
[null,null,{"$f":"Textes!A446","v":"4. Fiche Inv:"},null,{"$f":"Textes!A447","v":"Saisissez les teneurs des aliments et les inventaires début/fin"}]
[null,null,null,null,{"$f":"Textes!A448","v":"Attention : les teneurs des aliments doivent être saisies en g! Exemple : 21% MA= 210 g MA par kg aliment"}]
[]
[null,null,{"$f":"Textes!A449","v":"5. Fiche B1-B4"},null,{"$f":"Textes!A450","v":"Saisissez la quantité des aliments achetés."}]
[null,null,null,null,{"$f":"Textes!A451","v":"Comparer le total des aliments livrés dans cette année et le listing du fournisseur d’aliments."}]
[]
[null,null,{"$f":"Textes!A452","v":"6. Fiche Poulet_tot :"},null,{"$f":"Textes!A453","v":"Résultats concernant l’effectif moyen"}]
[]
[null,null,{"$f":"Textes!A454","v":"7. Fiche Impex :"},null,{"$f":"Textes!A455","v":"Résultat concernant le bilan import/export"}]
[null,null,null,null,{"$f":"Textes!A456","v":"Contrôle : Le bilan des animaux doit être égal à zéro, "}]
[]
[null,null,{"$f":"Textes!A457","v":"8. Fiche Plausi :"},null,{"$f":"Textes!A458","v":"Production des éléments nutritifs effectifs à reporter dans le Suisse-Bilanz"}]
[]
[null,null,{"$f":"Textes!A459","v":"2c) Indications supplémentaires pour des exploitations ayant des poulets à l’engrais extensif (Bio)"}]
[]
[null,null,{"$f":"Textes!A460","v":"Exploitation ayant des poulaillers de "},null,{"$f":"Textes!A462","v":"Saisir les rotations en alternand dans les fiches Poulet1 et Poulet2"}]
[null,null,{"$f":"Textes!A461","v":"pré-engraissement et d’engraissement"},null,{"$f":"Textes!A463","v":"Exemple: Rotations 1, 3, 5 => Fiche Poulet1; Rotations 2, 4, 6 => Fiche Poulet2"}]

{"sheet":"Inv","index":3,"n_rows":86,"n_cols":21,"rows_kept":86,"cut":false,"hidden":false,"merged":[[7,8,7,9],[8,8,8,9],[5,8,5,10]]}
[null,null,null,null,{"$f":"\"Impex:\"&\"   \"&R3","v":"Impex:   Production porcine"},null,null,null,null,null,{"$f":"Textes!A8","v":"Inventaire début et fin"}]
[]
[null,null,null,null,null,null,null,null,null,null,null,null,null,null,null,null,null,{"$f":"IF($U$4=1,Textes!G3,IF($U$4=2,Textes!G4,IF($U$4=3,Textes!G5,IF($U$4=4,Textes!G6,IF($U$4=5,Textes!G7)))))","v":"Production porcine"},false,null,{"$f":"IF(FuttermittelErweitert=FALSE(),0,1)","v":0}]
[null,null,{"$f":"Textes!A9&\"    \"","v":"No cantonal:    "},null,null,null,null,{"$f":"Textes!A15&\"    \"","v":"Calculé par:    "},null,null,null,null,null,null,null,null,null,null,null,null,{"$f":"Textes!$G$2","v":1}]
[null,null,{"$f":"Textes!A10&\"    \"","v":"Nom:    "},null,null,null,null,{"$f":"Textes!A17&\"    \"","v":"No téléphone:    "},null,null,null,null,null,null,null,null,null,null,null,null,{"$f":"Textes!SprachIdx","v":1}]
[null,null,{"$f":"Textes!A11&\"    \"","v":"Prénom:    "},null,null,null,null,{"$f":"Textes!A18&\"    \"","v":"Fax / e-mail:    "}]
[null,null,{"$f":"Textes!A13&\"    \"","v":"Adresse:    "},null,null,null,null,{"$f":"Textes!A16&\"    \"","v":"Firme:    "}]
[null,null,{"$f":"Textes!A12&\"    \"","v":"Complément:    "},null,null,null,null,{"$f":"Textes!A20&\"    \"","v":"Date début:    "},null,null,null,null,{"$f":"IF(AND(PRODUCT($I$8:$I$9)>0,$N$9>=0,$N$9<10),\"!!!\",\"\")","v":""}]
[null,null,{"$f":"Textes!A14&\"    \"","v":"NPA, lieu:    "},null,null,null,null,{"$f":"Textes!A21&\"    \"","v":"Date fin:    "},null,null,null,null,{"$f":"IF(AND(PRODUCT($I$8:$I$9)>0,$N$9>=0,$N$9<10),\"!!!\",\"\")","v":""},{"$f":"IF(ISERROR($O$9),0,$O$9)","v":0},{"$f":"DATEDIF(DatumAnfang,DatumEnde+1, \"M\")","v":0}]
[]
[null,null,null,null,{"$f":"Textes!A25","v":"Maximum"},{"$f":"Textes!A27","v":"Début de la période"},null,null,{"$f":"Textes!A28","v":"Fin de la période"},null,null,null,null,{"$f":"$F$12","v":"Nombre"},null,null,null,"Ende"]
[null,{"$f":"Textes!A24","v":"Inventaire des animaux"},null,null,{"$f":"Textes!A29","v":"Nombre"},{"$f":"Textes!A29","v":"Nombre"},{"$f":"Textes!A30","v":"Poids"},{"$f":"G12","v":"Poids"},{"$f":"F12","v":"Nombre"},{"$f":"G12","v":"Poids"},{"$f":"H12","v":"Poids"},null,null,"< 60 kg",null,"> 60 kg",null,"< 60 kg",null,"> 60 kg"]
[null,null,null,null,{"$f":"Textes!A26","v":"de places"},null,{"$f":"Textes!A31","v":"PV / anim."},{"$f":"Textes!A32","v":"PV"},null,{"$f":"G13","v":"PV / anim."},{"$f":"H13","v":"PV"},null,null,{"$f":"$F$12","v":"Nombre"},{"$f":"Textes!$A$85","v":"kg PV total"},{"$f":"$F$12","v":"Nombre"},{"$f":"Textes!$A$85","v":"kg PV total"},{"$f":"$F$12","v":"Nombre"},{"$f":"Textes!$A$85","v":"kg PV total"},{"$f":"$F$12","v":"Nombre"},{"$f":"Textes!$A$85","v":"kg PV total"}]
[null,null,null,null,null,null,null,{"$f":" IF(F14<>\"\",F14*G14,\"\")","v":""},null,null,{"$f":" IF(I14<>\"\",I14*J14,\"\")","v":""},null,null,{"$f":"IF(G14<60,F14,0)","v":0},{"$f":"IF(G14<60,H14,0)","v":""},{"$f":"IF(N14=0,F14,0)","v":0},{"$f":"IF(O14=0,H14,0)","v":0},{"$f":"IF(J14<60,I14,0)","v":0},{"$f":"IF(J14<60,K14,0)","v":""},{"$f":"IF(R14=0,I14,0)","v":0},{"$f":"IF(S14=0,K14,0)","v":0}]
[null,{"$f":"IF(Textes!Q4>0,Textes!Q4,\"\")","v":1611},{"$f":"IF(Textes!R4>0,Textes!R4,\"\")","v":"Truies allaitantes"},null,null,null,null,{"$f":" IF(F15<>\"\",F15*G15,\"\")","v":""},null,null,{"$f":" IF(I15<>\"\",I15*J15,\"\")","v":""},null,null,{"$f":"IF(G15<60,F15,0)","v":0},"",0,0,0,"",0,0]
[null,{"$f":"IF(Textes!Q5>0,Textes!Q5,\"\")","v":1615},{"$f":"IF(Textes!R5>0,Textes!R5,\"\")","v":"Truies non allaitantes > 6 mois"},null,null,null,null,{"$f":" IF(F16<>\"\",F16*G16,\"\")","v":""},null,null,"",null,null,0,"",0,0,0,"",0,0]
[null,{"$f":"IF(Textes!Q6>0,Textes!Q6,\"\")","v":1621},{"$f":"IF(Textes!R6>0,Textes!R6,\"\")","v":"Verrats d'élevage"},null,null,null,null,{"$f":"IF(F17<>\"\",F17*G17,\"\")","v":""},null,null,"",null,null,0,"",0,0,0,"",0,0]
[null,{"$f":"IF(Textes!Q7>0,Textes!Q7,\"\")","v":1631},{"$f":"IF(Textes!R7>0,Textes!R7,\"\")","v":"Porcelets sevrés < 26 kg PV"},null,null,null,null,"",null,null,"",null,null,0,"",0,0,0,"",0,0]
[null,{"$f":"IF(Textes!Q8>0,Textes!Q8,\"\")","v":1635},{"$f":"IF(Textes!R8>0,Textes!R8,\"\")","v":"Porcelets allaités"},null,null,null,null,"",null,null,"",null,null,0,"",0,0,0,"",0,0]
[null,{"$f":"IF(Textes!Q9>0,Textes!Q9,\"\")","v":1639},{"$f":"IF(Textes!R9>0,Textes!R9,\"\")","v":"Porcs à l'engrais/remontes<6 mois"},null,null,null,null,"",null,null,"",null,null,0,"",0,0,0,"",0,0]
[null,{"$f":"IF(Textes!Q10>0,Textes!Q10,\"\")","v":1639},{"$f":"IF(Textes!R10>0,Textes!R10,\"\")","v":"Porcs à l'engrais/remontes<6 mois"},null,null,null,null,"",null,null,"",null,null,0,"",0,0,0,"",0,0]
[null,{"$f":"IF(Textes!Q11>0,Textes!Q11,\"\")","v":1639},{"$f":"IF(Textes!R11>0,Textes!R11,\"\")","v":"Porcs à l'engrais/remontes<6 mois"},null,null,null,null,"",null,null,"",null,null,0,"",0,0,0,"",0,0]
[null,{"$f":"Textes!A51","v":"Total inventaire animaux"},null,null,{"$f":"IF(SUM(E14:E22)=0,\"\",SUM(E14:E22))","v":""},{"$f":"IF(SUM(F14:F22)=0,0,SUM(F14:F22))","v":0},{"$f":"IF(ISERROR(H23/F23)=TRUE,\"\",H23/F23)","v":""},{"$f":"IF(SUM(H14:H22)=0,\"\",SUM(H14:H22))","v":""},{"$f":"IF(SUM(I14:I22)=0,0,SUM(I14:I22))","v":0},{"$f":"IF(ISERROR(K23/I23)=TRUE,\"\",K23/I23)","v":""},{"$f":"IF(SUM(K14:K22)=0,\"\",SUM(K14:K22))","v":""},null,null,{"$f":"SUM(N14:N22)","v":0},{"$f":"SUM(O14:O22)","v":0},0,0,0,0,0,0]
[]
[null,{"$f":"Textes!A52","v":"Inventaire aliments"},null,null,null,{"$f":"Textes!A54","v":"Teneur par kg aliment"},null,null,null,{"$f":"Textes!A58","v":"Début"},{"$f":"Textes!A59","v":"Fin"}]
[null,{"$f":"Textes!A53","v":"Aliments"},null,null,null,{"$f":"Textes!A55","v":"MS en %"},{"$f":"Textes!A6","v":"MJ EDP"},{"$f":"Textes!A56","v":"g MA"},{"$f":"Textes!A57","v":"g P"},{"$f":"Textes!A60","v":"kg d'aliment"}]
[]
[]
[]
[]
[]
[]
[]
[]
[]
[]
[]
[]
[]
[]
[]
[]
[]
[]
[]
[]
[]
[]
[]
[]
[]
[]
[]
[]
[]
[]
[]
[]
[]
[]
[null,{"$f":"B25","v":"Inventaire aliments"},null,null,null,{"$f":"Textes!A62","v":"Teneurs par kg de MS"},null,null,null,{"$f":"J25","v":"Début"},{"$f":"K25","v":"Fin"}]
[null,{"$f":"Textes!A61","v":"Autres aliments"},null,null,null,{"$f":"F26","v":"MS en %"},{"$f":"G26","v":"MJ EDP"},{"$f":"H26","v":"g MA"},{"$f":"I26","v":"g P"},{"$f":"Textes!A63","v":"kg de MF"}]
[]
[]
[]
[]
[]
[]
[]
[]
[]
[null,{"$f":"Textes!A71","v":"Lactosérum"},null,null,null,6,14.6,129,7.3]
[null,{"$f":"Textes!A72","v":"CCM"},null,null,null,61,15.7,95,3.3]
[null,{"$f":"Textes!A64","v":"Paille, granulés de paille"},null,null,null,88,2.2000000000000002,35,0.9]
[null,{"$f":"Textes!A65","v":"Matériaux d’occupation, dés de fourrage grossier"},null,null,null,87,2.1,25,1.6]
[null,{"$f":"Textes!A66","v":"Fourrages"},null,null,null,null,null,null,null,{"$f":"Textes!A67","v":"kg de MS"}]
[null,{"$f":"Textes!A68","v":"Maïs, \nplante entière"},null,null,null,100,10.7,75,1.9]
[null,{"$f":"Textes!A69","v":"Ensilages de céréales \nplante entière"},null,null,null,30,7.4,92,3.2]
[null,{"$f":"Textes!A70","v":"Herbages: \nherbe, silo, …"},null,null,null,100,7.6,155,3.5]
[]
[null,{"$f":"Textes!A75","v":"L'exploitant certifie l'exactitude des informations saisies sur cette feuille ainsi que les indications sur les entrées"}]
[null,{"$f":"Textes!A76","v":"et les sorties d'animaux, les achats d'aliments."}]
[]
[null,{"$f":"Textes!A73","v":"Organisation de contrôle, Date:"},null,null,null,null,null,{"$f":"Textes!A74","v":"Signature:"}]
[]
[null,{"$f":"Textes!A77","v":"Exploitant, Date:"},null,null,null,null,null,{"$f":"H84","v":"Signature:"}]

{"sheet":"A1a","index":4,"n_rows":65,"n_cols":11,"rows_kept":65,"cut":false,"hidden":false,"merged":[]}
[null,null,null,{"$f":"+Inv!E1","v":"Impex:   Production porcine"},null,null,{"$f":"\"A1a: \"&K6","v":"A1a: Entrée animaux"}]
[null,{"$f":"Inv!C4&IF(Inv!D4=0,\"\",Inv!D4)","v":"No cantonal:    "},null,null,{"$f":"Inv!C5&IF(Inv!D5=0,\"\",Inv!D6&\" \"&Inv!D5)","v":"Nom:    "}]
[]
[null,null,{"$f":"IF(Textes!G2=1,Textes!A80,Textes!A82)","v":"Entrée animaux < 60 kg PV"},null,null,{"$f":"IF(Textes!G2=1,Textes!A81,\"\")","v":"Entrée animaux > 60 kg PV"}]
[null,{"$f":"+Textes!A83","v":"Date"},{"$f":"+Textes!A84","v":"Nombre"},{"$f":"+Textes!A85","v":"kg PV total"},{"$f":"IF(Textes!G2=1,B5,\"\")","v":"Date"},{"$f":"IF(Textes!G2=1,C5,\"\")","v":"Nombre"},{"$f":"IF(Textes!G2=1,D5,\"\")","v":"kg PV total"}]
[null,null,null,null,null,null,null,null,null,null,{"$f":"Textes!A79","v":"Entrée animaux"}]
[]
[]
[]
[]
[]
[]
[]
[]
[]
[]
[]
[]
[]
[]
[]
[]
[]
[]
[]
[]
[]
[]
[]
[]
[]
[]
[]
[]
[]
[]
[]
[]
[]
[]
[]
[]
[]
[]
[]
[]
[]
[]
[]
[]
[]
[]
[]
[]
[]
[]
[]
[]
[]
[]
[null,{"$f":"+Textes!A86","v":"Total entrée"},{"$f":"IF(SUM(C6:C60)=0,0,SUM(C6:C60))","v":0},{"$f":"IF(SUM(D6:D60)=0,0,SUM(D6:D60))","v":0},{"$f":"+Textes!A86","v":"Total entrée"},{"$f":"IF(SUM(F6:F60)=0,0,SUM(F6:F60))","v":0},{"$f":"IF(SUM(G6:G60)=0,0,SUM(G6:G60))","v":0}]
[]
[null,{"$f":"+Textes!A73","v":"Organisation de contrôle, Date:"},null,null,{"$f":"+Textes!A88","v":"Signature:"}]
[]
[null,{"$f":"+Textes!A77","v":"Exploitant, Date:"},null,null,{"$f":"+Textes!A88","v":"Signature:"}]

{"sheet":"A1b","index":5,"n_rows":65,"n_cols":11,"rows_kept":65,"cut":false,"hidden":false,"merged":[]}
[null,null,null,{"$f":"+Inv!E1","v":"Impex:   Production porcine"},null,null,{"$f":"\"A1b: \"&K6","v":"A1b: Entrée animaux"}]
[null,{"$f":"Inv!C4&IF(Inv!D4=0,\"\",Inv!D4)","v":"No cantonal:    "},null,null,{"$f":"Inv!C5&IF(Inv!D5=0,\"\",Inv!D6&\" \"&Inv!D5)","v":"Nom:    "}]
[]
[null,null,{"$f":"IF(Textes!G2=1,Textes!A80,Textes!A82)","v":"Entrée animaux < 60 kg PV"},null,null,{"$f":"IF(Textes!G2=1,Textes!A81,\"\")","v":"Entrée animaux > 60 kg PV"}]
[null,{"$f":"+Textes!A83","v":"Date"},{"$f":"+Textes!A84","v":"Nombre"},{"$f":"+Textes!A85","v":"kg PV total"},{"$f":"IF(Textes!G2=1,B5,\"\")","v":"Date"},{"$f":"IF(Textes!G2=1,C5,\"\")","v":"Nombre"},{"$f":"IF(Textes!G2=1,D5,\"\")","v":"kg PV total"}]
[null,null,null,null,null,null,null,null,null,null,{"$f":"Textes!A79","v":"Entrée animaux"}]
[]
[]
[]
[]
[]
[]
[]
[]
[]
[]
[]
[]
[]
[]
[]
[]
[]
[]
[]
[]
[]
[]
[]
[]
[]
[]
[]
[]
[]
[]
[]
[]
[]
[]
[]
[]
[]
[]
[]
[]
[]
[]
[]
[]
[]
[]
[]
[]
[]
[]
[]
[]
[]
[]
[null,{"$f":"+Textes!A86","v":"Total entrée"},{"$f":"IF(SUM(C6:C60)=0,0,SUM(C6:C60))","v":0},{"$f":"IF(SUM(D6:D60)=0,0,SUM(D6:D60))","v":0},{"$f":"+Textes!A86","v":"Total entrée"},{"$f":"IF(SUM(F6:F60)=0,0,SUM(F6:F60))","v":0},{"$f":"IF(SUM(G6:G60)=0,0,SUM(G6:G60))","v":0}]
[]
[null,{"$f":"+Textes!A73","v":"Organisation de contrôle, Date:"},null,null,{"$f":"+Textes!A88","v":"Signature:"}]
[]
[null,{"$f":"+Textes!A77","v":"Exploitant, Date:"},null,null,{"$f":"+Textes!A88","v":"Signature:"}]

{"sheet":"A1c","index":6,"n_rows":65,"n_cols":11,"rows_kept":65,"cut":false,"hidden":false,"merged":[]}
[null,null,null,{"$f":"+Inv!E1","v":"Impex:   Production porcine"},null,null,{"$f":"\"A1c: \"&K6","v":"A1c: Entrée animaux"}]
[null,{"$f":"Inv!C4&IF(Inv!D4=0,\"\",Inv!D4)","v":"No cantonal:    "},null,null,{"$f":"Inv!C5&IF(Inv!D5=0,\"\",Inv!D6&\" \"&Inv!D5)","v":"Nom:    "}]
[]
[null,null,{"$f":"IF(Textes!G2=1,Textes!A80,Textes!A82)","v":"Entrée animaux < 60 kg PV"},null,null,{"$f":"IF(Textes!G2=1,Textes!A81,\"\")","v":"Entrée animaux > 60 kg PV"}]
[null,{"$f":"+Textes!A83","v":"Date"},{"$f":"+Textes!A84","v":"Nombre"},{"$f":"+Textes!A85","v":"kg PV total"},{"$f":"IF(Textes!G2=1,B5,\"\")","v":"Date"},{"$f":"IF(Textes!G2=1,C5,\"\")","v":"Nombre"},{"$f":"IF(Textes!G2=1,D5,\"\")","v":"kg PV total"}]
[null,null,null,null,null,null,null,null,null,null,{"$f":"Textes!A79","v":"Entrée animaux"}]
[]
[]
[]
[]
[]
[]
[]
[]
[]
[]
[]
[]
[]
[]
[]
[]
[]
[]
[]
[]
[]
[]
[]
[]
[]
[]
[]
[]
[]
[]
[]
[]
[]
[]
[]
[]
[]
[]
[]
[]
[]
[]
[]
[]
[]
[]
[]
[]
[]
[]
[]
[]
[]
[]
[null,{"$f":"+Textes!A86","v":"Total entrée"},{"$f":"IF(SUM(C6:C60)=0,0,SUM(C6:C60))","v":0},{"$f":"IF(SUM(D6:D60)=0,0,SUM(D6:D60))","v":0},{"$f":"+Textes!A86","v":"Total entrée"},{"$f":"IF(SUM(F6:F60)=0,0,SUM(F6:F60))","v":0},{"$f":"IF(SUM(G6:G60)=0,0,SUM(G6:G60))","v":0}]
[]
[null,{"$f":"+Textes!A73","v":"Organisation de contrôle, Date:"},null,null,{"$f":"+Textes!A88","v":"Signature:"}]
[]
[null,{"$f":"+Textes!A77","v":"Exploitant, Date:"},null,null,{"$f":"+Textes!A88","v":"Signature:"}]

{"sheet":"A1d","index":7,"n_rows":65,"n_cols":11,"rows_kept":65,"cut":false,"hidden":false,"merged":[]}
[null,null,null,{"$f":"+Inv!E1","v":"Impex:   Production porcine"},null,null,{"$f":"\"A1d: \"&K6","v":"A1d: Entrée animaux"}]
[null,{"$f":"Inv!C4&IF(Inv!D4=0,\"\",Inv!D4)","v":"No cantonal:    "},null,null,{"$f":"Inv!C5&IF(Inv!D5=0,\"\",Inv!D6&\" \"&Inv!D5)","v":"Nom:    "}]
[]
[null,null,{"$f":"IF(Textes!G2=1,Textes!A80,Textes!A82)","v":"Entrée animaux < 60 kg PV"},null,null,{"$f":"IF(Textes!G2=1,Textes!A81,\"\")","v":"Entrée animaux > 60 kg PV"}]
[null,{"$f":"+Textes!A83","v":"Date"},{"$f":"+Textes!A84","v":"Nombre"},{"$f":"+Textes!A85","v":"kg PV total"},{"$f":"IF(Textes!G2=1,B5,\"\")","v":"Date"},{"$f":"IF(Textes!G2=1,C5,\"\")","v":"Nombre"},{"$f":"IF(Textes!G2=1,D5,\"\")","v":"kg PV total"}]
[null,null,null,null,null,null,null,null,null,null,{"$f":"Textes!A79","v":"Entrée animaux"}]
[]
[]
[]
[]
[]
[]
[]
[]
[]
[]
[]
[]
[]
[]
[]
[]
[]
[]
[]
[]
[]
[]
[]
[]
[]
[]
[]
[]
[]
[]
[]
[]
[]
[]
[]
[]
[]
[]
[]
[]
[]
[]
[]
[]
[]
[]
[]
[]
[]
[]
[]
[]
[]
[]
[null,{"$f":"+Textes!A86","v":"Total entrée"},{"$f":"IF(SUM(C6:C60)=0,0,SUM(C6:C60))","v":0},{"$f":"IF(SUM(D6:D60)=0,0,SUM(D6:D60))","v":0},{"$f":"+Textes!A86","v":"Total entrée"},{"$f":"IF(SUM(F6:F60)=0,0,SUM(F6:F60))","v":0},{"$f":"IF(SUM(G6:G60)=0,0,SUM(G6:G60))","v":0}]
[]
[null,{"$f":"+Textes!A73","v":"Organisation de contrôle, Date:"},null,null,{"$f":"+Textes!A88","v":"Signature:"}]
[]
[null,{"$f":"+Textes!A77","v":"Exploitant, Date:"},null,null,{"$f":"+Textes!A88","v":"Signature:"}]

{"sheet":"A1e","index":8,"n_rows":65,"n_cols":11,"rows_kept":65,"cut":false,"hidden":false,"merged":[]}
[null,null,null,{"$f":"+Inv!E1","v":"Impex:   Production porcine"},null,null,{"$f":"\"A1e: \"&K6","v":"A1e: Entrée animaux"}]
[null,{"$f":"Inv!C4&IF(Inv!D4=0,\"\",Inv!D4)","v":"No cantonal:    "},null,null,{"$f":"Inv!C5&IF(Inv!D5=0,\"\",Inv!D6&\" \"&Inv!D5)","v":"Nom:    "}]
[]
[null,null,{"$f":"IF(Textes!G2=1,Textes!A80,Textes!A82)","v":"Entrée animaux < 60 kg PV"},null,null,{"$f":"IF(Textes!G2=1,Textes!A81,\"\")","v":"Entrée animaux > 60 kg PV"}]
[null,{"$f":"+Textes!A83","v":"Date"},{"$f":"+Textes!A84","v":"Nombre"},{"$f":"+Textes!A85","v":"kg PV total"},{"$f":"IF(Textes!G2=1,B5,\"\")","v":"Date"},{"$f":"IF(Textes!G2=1,C5,\"\")","v":"Nombre"},{"$f":"IF(Textes!G2=1,D5,\"\")","v":"kg PV total"}]
[null,null,null,null,null,null,null,null,null,null,{"$f":"Textes!A79","v":"Entrée animaux"}]
[]
[]
[]
[]
[]
[]
[]
[]
[]
[]
[]
[]
[]
[]
[]
[]
[]
[]
[]
[]
[]
[]
[]
[]
[]
[]
[]
[]
[]
[]
[]
[]
[]
[]
[]
[]
[]
[]
[]
[]
[]
[]
[]
[]
[]
[]
[]
[]
[]
[]
[]
[]
[]
[]
[null,{"$f":"+Textes!A86","v":"Total entrée"},{"$f":"IF(SUM(C6:C60)=0,0,SUM(C6:C60))","v":0},{"$f":"IF(SUM(D6:D60)=0,0,SUM(D6:D60))","v":0},{"$f":"+Textes!A86","v":"Total entrée"},{"$f":"IF(SUM(F6:F60)=0,0,SUM(F6:F60))","v":0},{"$f":"IF(SUM(G6:G60)=0,0,SUM(G6:G60))","v":0}]
[]
[null,{"$f":"+Textes!A73","v":"Organisation de contrôle, Date:"},null,null,{"$f":"+Textes!A88","v":"Signature:"}]
[]
[null,{"$f":"+Textes!A77","v":"Exploitant, Date:"},null,null,{"$f":"+Textes!A88","v":"Signature:"}]

{"sheet":"A2a","index":9,"n_rows":66,"n_cols":11,"rows_kept":66,"cut":false,"hidden":false,"merged":[]}
[null,null,null,{"$f":"+A1a!D1","v":"Impex:   Production porcine"},null,null,null,{"$f":"\"A2a: \"&K8","v":"A2a: Sortie animaux"}]
[null,null,null,null,null,{"$f":"Textes!$A$90","v":"Choisissez la catégorie correcte!"},null,null,null,1]
[null,{"$f":"Inv!C4 & IF(Inv!D4=0,\"\",Inv!D4)","v":"No cantonal:    "},null,null,{"$f":"Inv!C5 & IF(Inv!D5=0,\"\",Inv!D6 & \" \" & Inv!D5)","v":"Nom:    "}]
[null,{"$f":"+Textes!A92","v":"Inclure les ventes, les utilisations propres et les pertes d'animaux."},null,null,null,null,null,null,null,{"$f":"IF($J$2=3,Textes!$O$5,IF($J$2=2,Textes!$O$4,Textes!$O$3))","v":0.79}]
[]
[null,null,{"$f":"IF(Textes!G2=1,Textes!A93,Textes!A95)","v":"Sortie animaux < 60 kg PV"},null,null,{"$f":"IF(Textes!G2=1,Textes!A94,\"\")","v":"Sortie animaux > 60 kg PV"},null,null,null,"Verkauf"]
[null,{"$f":"+Textes!A96","v":"Date"},{"$f":"+Textes!A97","v":"Nombre"},{"$f":"+Textes!A98","v":"kg PV total"},{"$f":"IF(Textes!G2=1,B7,\"\")","v":"Date"},{"$f":"IF(Textes!G2=1,C7,\"\")","v":"Nombre"},{"$f":"IF(Textes!G2=1,D7,\"\")","v":"kg PV total"},{"$f":"IF(Textes!G2=1,Textes!A91,\"\")","v":"kg PM total *"},null,"Total LG"]
[null,null,null,null,null,null,null,null,null,{"$f":"IF(G8<(H8/$J$4),H8/$J$4,G8)","v":0},{"$f":"Textes!A89","v":"Sortie animaux"}]
[null,null,null,null,null,null,null,null,null,0]
[null,null,null,null,null,null,null,null,null,0]
[null,null,null,null,null,null,null,null,null,0]
[null,null,null,null,null,null,null,null,null,0]
[null,null,null,null,null,null,null,null,null,0]
[null,null,null,null,null,null,null,null,null,0]
[null,null,null,null,null,null,null,null,null,0]
[null,null,null,null,null,null,null,null,null,0]
[null,null,null,null,null,null,null,null,null,0]
[null,null,null,null,null,null,null,null,null,0]
[null,null,null,null,null,null,null,null,null,0]
[null,null,null,null,null,null,null,null,null,0]
[null,null,null,null,null,null,null,null,null,0]
[null,null,null,null,null,null,null,null,null,0]
[null,null,null,null,null,null,null,null,null,0]
[null,null,null,null,null,null,null,null,null,0]
[null,null,null,null,null,null,null,null,null,0]
[null,null,null,null,null,null,null,null,null,0]
[null,null,null,null,null,null,null,null,null,0]
[null,null,null,null,null,null,null,null,null,0]
[null,null,null,null,null,null,null,null,null,0]
[null,null,null,null,null,null,null,null,null,0]
[null,null,null,null,null,null,null,null,null,0]
[null,null,null,null,null,null,null,null,null,0]
[null,null,null,null,null,null,null,null,null,0]
[null,null,null,null,null,null,null,null,null,0]
[null,null,null,null,null,null,null,null,null,0]
[null,null,null,null,null,null,null,null,null,0]
[null,null,null,null,null,null,null,null,null,0]
[null,null,null,null,null,null,null,null,null,0]
[null,null,null,null,null,null,null,null,null,0]
[null,null,null,null,null,null,null,null,null,{"$f":"IF(G40<(H40/$J$4),H40/$J$4,G40)","v":0}]
[null,null,null,null,null,null,null,null,null,0]
[null,null,null,null,null,null,null,null,null,0]
[null,null,null,null,null,null,null,null,null,0]
[null,null,null,null,null,null,null,null,null,0]
[null,null,null,null,null,null,null,null,null,0]
[null,null,null,null,null,null,null,null,null,0]
[null,null,null,null,null,null,null,null,null,0]
[null,null,null,null,null,null,null,null,null,0]
[null,null,null,null,null,null,null,null,null,0]
[null,null,null,null,null,null,null,null,null,0]
[null,null,null,null,null,null,null,null,null,0]
[null,null,null,null,null,null,null,null,null,0]
[null,null,null,null,null,null,null,null,null,0]
[null,null,null,null,null,null,null,null,null,0]
[null,null,null,null,null,null,null,null,null,0]
[null,null,null,null,null,null,null,null,null,0]
[null,null,null,null,null,null,null,null,null,0]
[null,null,null,null,null,null,null,null,null,0]
[null,null,null,null,null,null,null,null,null,0]
[null,null,null,null,null,null,null,null,null,0]
[null,{"$f":"+Textes!A99","v":"Total sortie"},{"$f":"IF(SUM(C8:C60)=0,0,SUM(C8:C60))","v":0},{"$f":"IF(SUM(D8:D60)=0,0,SUM(D8:D60))","v":0},{"$f":"+B61","v":"Total sortie"},{"$f":"IF(SUM(F8:F60)=0,0,SUM(F8:F60))","v":0},{"$f":"IF(J61=0,0,J61)","v":0},null,null,{"$f":"SUM(J8:J60)","v":0}]
[null,{"$f":"IF(Textes!G2=1,Textes!A102,\"\")","v":"* = selon le système; en kg PV ou PM"}]
[]
[null,{"$f":"+Textes!A73","v":"Organisation de contrôle, Date:"},null,null,null,{"$f":"+Textes!A74","v":"Signature:"}]
[null,null,null,null,null,null,null,null,null,".........................................…"]
[null,{"$f":"+Textes!A77","v":"Exploitant, Date:"},null,null,null,{"$f":"+Textes!A74","v":"Signature:"}]

{"sheet":"A2b","index":10,"n_rows":66,"n_cols":11,"rows_kept":66,"cut":false,"hidden":false,"merged":[]}
[null,null,null,{"$f":"+A1a!D1","v":"Impex:   Production porcine"},null,null,null,{"$f":"\"A2b: \"&K8","v":"A2b: Sortie animaux"}]
[null,null,null,null,null,{"$f":"Textes!$A$90","v":"Choisissez la catégorie correcte!"},null,null,null,1]
[null,{"$f":"Inv!C4 & IF(Inv!D4=0,\"\",Inv!D4)","v":"No cantonal:    "},null,null,{"$f":"Inv!C5 & IF(Inv!D5=0,\"\",Inv!D6 & \" \" & Inv!D5)","v":"Nom:    "}]
[null,{"$f":"+Textes!A92","v":"Inclure les ventes, les utilisations propres et les pertes d'animaux."},null,null,null,null,null,null,null,{"$f":"IF($J$2=3,Textes!$O$5,IF($J$2=2,Textes!$O$4,Textes!$O$3))","v":0.79}]
[]
[null,null,{"$f":"IF(Textes!G2=1,Textes!A93,Textes!A95)","v":"Sortie animaux < 60 kg PV"},null,null,{"$f":"IF(Textes!G2=1,Textes!A94,\"\")","v":"Sortie animaux > 60 kg PV"},null,null,null,"Verkauf"]
[null,{"$f":"+Textes!A96","v":"Date"},{"$f":"+Textes!A97","v":"Nombre"},{"$f":"+Textes!A98","v":"kg PV total"},{"$f":"IF(Textes!G2=1,B7,\"\")","v":"Date"},{"$f":"IF(Textes!G2=1,C7,\"\")","v":"Nombre"},{"$f":"IF(Textes!G2=1,D7,\"\")","v":"kg PV total"},{"$f":"IF(Textes!G2=1,Textes!A91,\"\")","v":"kg PM total *"},null,"Total LG"]
[null,null,null,null,null,null,null,null,null,{"$f":"IF(G8<(H8/$J$4),H8/$J$4,G8)","v":0},{"$f":"Textes!A89","v":"Sortie animaux"}]
[null,null,null,null,null,null,null,null,null,{"$f":"IF(G9<(H9/$J$4),H9/$J$4,G9)","v":0}]
[null,null,null,null,null,null,null,null,null,0]
[null,null,null,null,null,null,null,null,null,0]
[null,null,null,null,null,null,null,null,null,0]
[null,null,null,null,null,null,null,null,null,0]
[null,null,null,null,null,null,null,null,null,0]
[null,null,null,null,null,null,null,null,null,0]
[null,null,null,null,null,null,null,null,null,0]
[null,null,null,null,null,null,null,null,null,0]
[null,null,null,null,null,null,null,null,null,0]
[null,null,null,null,null,null,null,null,null,0]
[null,null,null,null,null,null,null,null,null,0]
[null,null,null,null,null,null,null,null,null,0]
[null,null,null,null,null,null,null,null,null,0]
[null,null,null,null,null,null,null,null,null,0]
[null,null,null,null,null,null,null,null,null,0]
[null,null,null,null,null,null,null,null,null,0]
[null,null,null,null,null,null,null,null,null,0]
[null,null,null,null,null,null,null,null,null,0]
[null,null,null,null,null,null,null,null,null,0]
[null,null,null,null,null,null,null,null,null,0]
[null,null,null,null,null,null,null,null,null,0]
[null,null,null,null,null,null,null,null,null,0]
[null,null,null,null,null,null,null,null,null,0]
[null,null,null,null,null,null,null,null,null,0]
[null,null,null,null,null,null,null,null,null,0]
[null,null,null,null,null,null,null,null,null,0]
[null,null,null,null,null,null,null,null,null,0]
[null,null,null,null,null,null,null,null,null,0]
[null,null,null,null,null,null,null,null,null,0]
[null,null,null,null,null,null,null,null,null,0]
[null,null,null,null,null,null,null,null,null,0]
[null,null,null,null,null,null,null,null,null,0]
[null,null,null,null,null,null,null,null,null,0]
[null,null,null,null,null,null,null,null,null,0]
[null,null,null,null,null,null,null,null,null,0]
[null,null,null,null,null,null,null,null,null,0]
[null,null,null,null,null,null,null,null,null,0]
[null,null,null,null,null,null,null,null,null,0]
[null,null,null,null,null,null,null,null,null,0]
[null,null,null,null,null,null,null,null,null,0]
[null,null,null,null,null,null,null,null,null,0]
[null,null,null,null,null,null,null,null,null,0]
[null,null,null,null,null,null,null,null,null,0]
[null,null,null,null,null,null,null,null,null,0]
[null,null,null,null,null,null,null,null,null,0]
[null,null,null,null,null,null,null,null,null,0]
[null,null,null,null,null,null,null,null,null,0]
[null,null,null,null,null,null,null,null,null,0]
[null,null,null,null,null,null,null,null,null,0]
[null,null,null,null,null,null,null,null,null,0]
[null,null,null,null,null,null,null,null,null,0]
[null,{"$f":"+Textes!A99","v":"Total sortie"},{"$f":"IF(SUM(C8:C60)=0,0,SUM(C8:C60))","v":0},{"$f":"IF(SUM(D8:D60)=0,0,SUM(D8:D60))","v":0},{"$f":"+B61","v":"Total sortie"},{"$f":"IF(SUM(F8:F60)=0,0,SUM(F8:F60))","v":0},{"$f":"IF(J61=0,0,J61)","v":0},null,null,{"$f":"SUM(J8:J60)","v":0}]
[null,{"$f":"IF(Textes!G2=1,Textes!A102,\"\")","v":"* = selon le système; en kg PV ou PM"}]
[]
[null,{"$f":"+Textes!A73","v":"Organisation de contrôle, Date:"},null,null,null,{"$f":"+Textes!A74","v":"Signature:"}]
[null,null,null,null,null,null,null,null,null,".........................................…"]
[null,{"$f":"+Textes!A77","v":"Exploitant, Date:"},null,null,null,{"$f":"+Textes!A74","v":"Signature:"}]

{"sheet":"A2c","index":11,"n_rows":66,"n_cols":11,"rows_kept":66,"cut":false,"hidden":false,"merged":[]}
[null,null,null,{"$f":"+A1a!D1","v":"Impex:   Production porcine"},null,null,null,{"$f":"\"A2c: \"&K8","v":"A2c: Sortie animaux"}]
[null,null,null,null,null,{"$f":"Textes!$A$90","v":"Choisissez la catégorie correcte!"},null,null,null,1]
[null,{"$f":"Inv!C4 & IF(Inv!D4=0,\"\",Inv!D4)","v":"No cantonal:    "},null,null,{"$f":"Inv!C5 & IF(Inv!D5=0,\"\",Inv!D6 & \" \" & Inv!D5)","v":"Nom:    "}]
[null,{"$f":"+Textes!A92","v":"Inclure les ventes, les utilisations propres et les pertes d'animaux."},null,null,null,null,null,null,null,{"$f":"IF($J$2=3,Textes!$O$5,IF($J$2=2,Textes!$O$4,Textes!$O$3))","v":0.79}]
[]
[null,null,{"$f":"IF(Textes!G2=1,Textes!A93,Textes!A95)","v":"Sortie animaux < 60 kg PV"},null,null,{"$f":"IF(Textes!G2=1,Textes!A94,\"\")","v":"Sortie animaux > 60 kg PV"},null,null,null,"Verkauf"]
[null,{"$f":"+Textes!A96","v":"Date"},{"$f":"+Textes!A97","v":"Nombre"},{"$f":"+Textes!A98","v":"kg PV total"},{"$f":"IF(Textes!G2=1,B7,\"\")","v":"Date"},{"$f":"IF(Textes!G2=1,C7,\"\")","v":"Nombre"},{"$f":"IF(Textes!G2=1,D7,\"\")","v":"kg PV total"},{"$f":"IF(Textes!G2=1,Textes!A91,\"\")","v":"kg PM total *"},null,"Total LG"]
[null,null,null,null,null,null,null,null,null,{"$f":"IF(G8<(H8/$J$4),H8/$J$4,G8)","v":0},{"$f":"Textes!A89","v":"Sortie animaux"}]
[null,null,null,null,null,null,null,null,null,{"$f":"IF(G9<(H9/$J$4),H9/$J$4,G9)","v":0}]
[null,null,null,null,null,null,null,null,null,0]
[null,null,null,null,null,null,null,null,null,0]
[null,null,null,null,null,null,null,null,null,0]
[null,null,null,null,null,null,null,null,null,0]
[null,null,null,null,null,null,null,null,null,0]
[null,null,null,null,null,null,null,null,null,0]
[null,null,null,null,null,null,null,null,null,0]
[null,null,null,null,null,null,null,null,null,0]
[null,null,null,null,null,null,null,null,null,0]
[null,null,null,null,null,null,null,null,null,0]
[null,null,null,null,null,null,null,null,null,0]
[null,null,null,null,null,null,null,null,null,0]
[null,null,null,null,null,null,null,null,null,0]
[null,null,null,null,null,null,null,null,null,0]
[null,null,null,null,null,null,null,null,null,0]
[null,null,null,null,null,null,null,null,null,0]
[null,null,null,null,null,null,null,null,null,0]
[null,null,null,null,null,null,null,null,null,0]
[null,null,null,null,null,null,null,null,null,0]
[null,null,null,null,null,null,null,null,null,0]
[null,null,null,null,null,null,null,null,null,0]
[null,null,null,null,null,null,null,null,null,0]
[null,null,null,null,null,null,null,null,null,0]
[null,null,null,null,null,null,null,null,null,0]
[null,null,null,null,null,null,null,null,null,0]
[null,null,null,null,null,null,null,null,null,0]
[null,null,null,null,null,null,null,null,null,0]
[null,null,null,null,null,null,null,null,null,0]
[null,null,null,null,null,null,null,null,null,0]
[null,null,null,null,null,null,null,null,null,0]
[null,null,null,null,null,null,null,null,null,0]
[null,null,null,null,null,null,null,null,null,0]
[null,null,null,null,null,null,null,null,null,0]
[null,null,null,null,null,null,null,null,null,0]
[null,null,null,null,null,null,null,null,null,0]
[null,null,null,null,null,null,null,null,null,0]
[null,null,null,null,null,null,null,null,null,0]
[null,null,null,null,null,null,null,null,null,0]
[null,null,null,null,null,null,null,null,null,0]
[null,null,null,null,null,null,null,null,null,0]
[null,null,null,null,null,null,null,null,null,0]
[null,null,null,null,null,null,null,null,null,0]
[null,null,null,null,null,null,null,null,null,0]
[null,null,null,null,null,null,null,null,null,0]
[null,null,null,null,null,null,null,null,null,0]
[null,null,null,null,null,null,null,null,null,0]
[null,null,null,null,null,null,null,null,null,0]
[null,null,null,null,null,null,null,null,null,0]
[null,null,null,null,null,null,null,null,null,0]
[null,null,null,null,null,null,null,null,null,0]
[null,null,null,null,null,null,null,null,null,0]
[null,{"$f":"+Textes!A99","v":"Total sortie"},{"$f":"IF(SUM(C8:C60)=0,0,SUM(C8:C60))","v":0},{"$f":"IF(SUM(D8:D60)=0,0,SUM(D8:D60))","v":0},{"$f":"+B61","v":"Total sortie"},{"$f":"IF(SUM(F8:F60)=0,0,SUM(F8:F60))","v":0},{"$f":"IF(J61=0,0,J61)","v":0},null,null,{"$f":"SUM(J8:J60)","v":0}]
[null,{"$f":"IF(Textes!G2=1,Textes!A102,\"\")","v":"* = selon le système; en kg PV ou PM"}]
[]
[null,{"$f":"+Textes!A73","v":"Organisation de contrôle, Date:"},null,null,null,{"$f":"+Textes!A74","v":"Signature:"}]
[null,null,null,null,null,null,null,null,null,".........................................…"]
[null,{"$f":"+Textes!A77","v":"Exploitant, Date:"},null,null,null,{"$f":"+Textes!A74","v":"Signature:"}]

{"sheet":"A2d","index":12,"n_rows":66,"n_cols":11,"rows_kept":66,"cut":false,"hidden":false,"merged":[]}
[null,null,null,{"$f":"+A1a!D1","v":"Impex:   Production porcine"},null,null,null,{"$f":"\"A2d: \"& K8","v":"A2d: Sortie animaux"}]
[null,null,null,null,null,{"$f":"Textes!$A$90","v":"Choisissez la catégorie correcte!"},null,null,null,1]
[null,{"$f":"Inv!C4 & IF(Inv!D4=0,\"\",Inv!D4)","v":"No cantonal:    "},null,null,{"$f":"Inv!C5 & IF(Inv!D5=0,\"\",Inv!D6 & \" \" & Inv!D5)","v":"Nom:    "}]
[null,{"$f":"+Textes!A92","v":"Inclure les ventes, les utilisations propres et les pertes d'animaux."},null,null,null,null,null,null,null,{"$f":"IF($J$2=3,Textes!$O$5,IF($J$2=2,Textes!$O$4,Textes!$O$3))","v":0.79}]
[]
[null,null,{"$f":"IF(Textes!G2=1,Textes!A93,Textes!A95)","v":"Sortie animaux < 60 kg PV"},null,null,{"$f":"IF(Textes!G2=1,Textes!A94,\"\")","v":"Sortie animaux > 60 kg PV"},null,null,null,"Verkauf"]
[null,{"$f":"+Textes!A96","v":"Date"},{"$f":"+Textes!A97","v":"Nombre"},{"$f":"+Textes!A98","v":"kg PV total"},{"$f":"IF(Textes!G2=1,B7,\"\")","v":"Date"},{"$f":"IF(Textes!G2=1,C7,\"\")","v":"Nombre"},{"$f":"IF(Textes!G2=1,D7,\"\")","v":"kg PV total"},{"$f":"IF(Textes!G2=1,Textes!A91,\"\")","v":"kg PM total *"},null,"Total LG"]
[null,null,null,null,null,null,null,null,null,{"$f":"IF(G8<(H8/$J$4),H8/$J$4,G8)","v":0},{"$f":"Textes!A89","v":"Sortie animaux"}]
[null,null,null,null,null,null,null,null,null,{"$f":"IF(G9<(H9/$J$4),H9/$J$4,G9)","v":0}]
[null,null,null,null,null,null,null,null,null,0]
[null,null,null,null,null,null,null,null,null,0]
[null,null,null,null,null,null,null,null,null,0]
[null,null,null,null,null,null,null,null,null,0]
[null,null,null,null,null,null,null,null,null,0]
[null,null,null,null,null,null,null,null,null,0]
[null,null,null,null,null,null,null,null,null,0]
[null,null,null,null,null,null,null,null,null,0]
[null,null,null,null,null,null,null,null,null,0]
[null,null,null,null,null,null,null,null,null,0]
[null,null,null,null,null,null,null,null,null,0]
[null,null,null,null,null,null,null,null,null,0]
[null,null,null,null,null,null,null,null,null,0]
[null,null,null,null,null,null,null,null,null,0]
[null,null,null,null,null,null,null,null,null,0]
[null,null,null,null,null,null,null,null,null,0]
[null,null,null,null,null,null,null,null,null,0]
[null,null,null,null,null,null,null,null,null,0]
[null,null,null,null,null,null,null,null,null,0]
[null,null,null,null,null,null,null,null,null,0]
[null,null,null,null,null,null,null,null,null,0]
[null,null,null,null,null,null,null,null,null,0]
[null,null,null,null,null,null,null,null,null,0]
[null,null,null,null,null,null,null,null,null,0]
[null,null,null,null,null,null,null,null,null,0]
[null,null,null,null,null,null,null,null,null,0]
[null,null,null,null,null,null,null,null,null,0]
[null,null,null,null,null,null,null,null,null,0]
[null,null,null,null,null,null,null,null,null,0]
[null,null,null,null,null,null,null,null,null,0]
[null,null,null,null,null,null,null,null,null,0]
[null,null,null,null,null,null,null,null,null,0]
[null,null,null,null,null,null,null,null,null,0]
[null,null,null,null,null,null,null,null,null,0]
[null,null,null,null,null,null,null,null,null,0]
[null,null,null,null,null,null,null,null,null,0]
[null,null,null,null,null,null,null,null,null,0]
[null,null,null,null,null,null,null,null,null,0]
[null,null,null,null,null,null,null,null,null,0]
[null,null,null,null,null,null,null,null,null,0]
[null,null,null,null,null,null,null,null,null,0]
[null,null,null,null,null,null,null,null,null,0]
[null,null,null,null,null,null,null,null,null,0]
[null,null,null,null,null,null,null,null,null,0]
[null,null,null,null,null,null,null,null,null,0]
[null,null,null,null,null,null,null,null,null,0]
[null,null,null,null,null,null,null,null,null,0]
[null,null,null,null,null,null,null,null,null,0]
[null,null,null,null,null,null,null,null,null,0]
[null,null,null,null,null,null,null,null,null,0]
[null,null,null,null,null,null,null,null,null,0]
[null,{"$f":"+Textes!A99","v":"Total sortie"},{"$f":"IF(SUM(C8:C60)=0,0,SUM(C8:C60))","v":0},{"$f":"IF(SUM(D8:D60)=0,0,SUM(D8:D60))","v":0},{"$f":"+B61","v":"Total sortie"},{"$f":"IF(SUM(F8:F60)=0,0,SUM(F8:F60))","v":0},{"$f":"IF(J61=0,0,J61)","v":0},null,null,{"$f":"SUM(J8:J60)","v":0}]
[null,{"$f":"IF(Textes!G2=1,Textes!A102,\"\")","v":"* = selon le système; en kg PV ou PM"}]
[]
[null,{"$f":"+Textes!A73","v":"Organisation de contrôle, Date:"},null,null,null,{"$f":"+Textes!A74","v":"Signature:"}]
[null,null,null,null,null,null,null,null,null,".........................................…"]
[null,{"$f":"+Textes!A77","v":"Exploitant, Date:"},null,null,null,{"$f":"+Textes!A74","v":"Signature:"}]

{"sheet":"A2e","index":13,"n_rows":66,"n_cols":11,"rows_kept":66,"cut":false,"hidden":false,"merged":[]}
[null,null,null,{"$f":"+A1a!D1","v":"Impex:   Production porcine"},null,null,null,{"$f":"\"A2e: \"&K8","v":"A2e: Sortie animaux"}]
[null,null,null,null,null,{"$f":"Textes!$A$90","v":"Choisissez la catégorie correcte!"},null,null,null,1]
[null,{"$f":"Inv!C4 & IF(Inv!D4=0,\"\",Inv!D4)","v":"No cantonal:    "},null,null,{"$f":"Inv!C5 & IF(Inv!D5=0,\"\",Inv!D6 & \" \" & Inv!D5)","v":"Nom:    "}]
[null,{"$f":"+Textes!A92","v":"Inclure les ventes, les utilisations propres et les pertes d'animaux."},null,null,null,null,null,null,null,{"$f":"IF($J$2=3,Textes!$O$5,IF($J$2=2,Textes!$O$4,Textes!$O$3))","v":0.79}]
[]
[null,null,{"$f":"IF(Textes!G2=1,Textes!A93,Textes!A95)","v":"Sortie animaux < 60 kg PV"},null,null,{"$f":"IF(Textes!G2=1,Textes!A94,\"\")","v":"Sortie animaux > 60 kg PV"},null,null,null,"Verkauf"]
[null,{"$f":"+Textes!A96","v":"Date"},{"$f":"+Textes!A97","v":"Nombre"},{"$f":"+Textes!A98","v":"kg PV total"},{"$f":"IF(Textes!G2=1,B7,\"\")","v":"Date"},{"$f":"IF(Textes!G2=1,C7,\"\")","v":"Nombre"},{"$f":"IF(Textes!G2=1,D7,\"\")","v":"kg PV total"},{"$f":"IF(Textes!G2=1,Textes!A91,\"\")","v":"kg PM total *"},null,"Total LG"]
[null,null,null,null,null,null,null,null,null,{"$f":"IF(G8<(H8/$J$4),H8/$J$4,G8)","v":0},{"$f":"Textes!A89","v":"Sortie animaux"}]
[null,null,null,null,null,null,null,null,null,{"$f":"IF(G9<(H9/$J$4),H9/$J$4,G9)","v":0}]
[null,null,null,null,null,null,null,null,null,0]
[null,null,null,null,null,null,null,null,null,0]
[null,null,null,null,null,null,null,null,null,0]
[null,null,null,null,null,null,null,null,null,0]
[null,null,null,null,null,null,null,null,null,0]
[null,null,null,null,null,null,null,null,null,0]
[null,null,null,null,null,null,null,null,null,0]
[null,null,null,null,null,null,null,null,null,0]
[null,null,null,null,null,null,null,null,null,0]
[null,null,null,null,null,null,null,null,null,0]
[null,null,null,null,null,null,null,null,null,0]
[null,null,null,null,null,null,null,null,null,0]
[null,null,null,null,null,null,null,null,null,0]
[null,null,null,null,null,null,null,null,null,0]
[null,null,null,null,null,null,null,null,null,0]
[null,null,null,null,null,null,null,null,null,0]
[null,null,null,null,null,null,null,null,null,0]
[null,null,null,null,null,null,null,null,null,0]
[null,null,null,null,null,null,null,null,null,0]
[null,null,null,null,null,null,null,null,null,0]
[null,null,null,null,null,null,null,null,null,0]
[null,null,null,null,null,null,null,null,null,0]
[null,null,null,null,null,null,null,null,null,0]
[null,null,null,null,null,null,null,null,null,0]
[null,null,null,null,null,null,null,null,null,0]
[null,null,null,null,null,null,null,null,null,0]
[null,null,null,null,null,null,null,null,null,0]
[null,null,null,null,null,null,null,null,null,0]
[null,null,null,null,null,null,null,null,null,0]
[null,null,null,null,null,null,null,null,null,0]
[null,null,null,null,null,null,null,null,null,0]
[null,null,null,null,null,null,null,null,null,0]
[null,null,null,null,null,null,null,null,null,0]
[null,null,null,null,null,null,null,null,null,0]
[null,null,null,null,null,null,null,null,null,0]
[null,null,null,null,null,null,null,null,null,0]
[null,null,null,null,null,null,null,null,null,0]
[null,null,null,null,null,null,null,null,null,0]
[null,null,null,null,null,null,null,null,null,0]
[null,null,null,null,null,null,null,null,null,0]
[null,null,null,null,null,null,null,null,null,0]
[null,null,null,null,null,null,null,null,null,0]
[null,null,null,null,null,null,null,null,null,0]
[null,null,null,null,null,null,null,null,null,0]
[null,null,null,null,null,null,null,null,null,0]
[null,null,null,null,null,null,null,null,null,0]
[null,null,null,null,null,null,null,null,null,0]
[null,null,null,null,null,null,null,null,null,0]
[null,null,null,null,null,null,null,null,null,0]
[null,null,null,null,null,null,null,null,null,0]
[null,null,null,null,null,null,null,null,null,0]
[null,{"$f":"+Textes!A99","v":"Total sortie"},{"$f":"IF(SUM(C8:C60)=0,0,SUM(C8:C60))","v":0},{"$f":"IF(SUM(D8:D60)=0,0,SUM(D8:D60))","v":0},{"$f":"+B61","v":"Total sortie"},{"$f":"IF(SUM(F8:F60)=0,0,SUM(F8:F60))","v":0},{"$f":"IF(J61=0,0,J61)","v":0},null,null,{"$f":"SUM(J8:J60)","v":0}]
[null,{"$f":"IF(Textes!G2=1,Textes!A102,\"\")","v":"* = selon le système; en kg PV ou PM"}]
[]
[null,{"$f":"+Textes!A73","v":"Organisation de contrôle, Date:"},null,null,null,{"$f":"+Textes!A74","v":"Signature:"}]
[null,null,null,null,null,null,null,null,null,".........................................…"]
[null,{"$f":"+Textes!A77","v":"Exploitant, Date:"},null,null,null,{"$f":"+Textes!A74","v":"Signature:"}]

{"sheet":"B1","index":14,"n_rows":64,"n_cols":11,"rows_kept":64,"cut":false,"hidden":false,"merged":[]}
[null,null,null,{"$f":"+A2a!D1","v":"Impex:   Production porcine"},null,null,null,null,{"$f":"\"B1: \"&K13","v":"B1: Entrée aliments"}]
[null,{"$f":"Inv!C4&IF(Inv!D4=0,\"\",Inv!D4)","v":"No cantonal:    "},null,null,null,{"$f":"Inv!C5&IF(Inv!D5=0,\"\",Inv!D6&\" \"&Inv!D5)","v":"Nom:    "}]
[]
[null,{"$f":"+Textes!A105","v":"Moulin"},null,{"$f":"+B4","v":"Moulin"},null,{"$f":"+D4","v":"Moulin"},null,{"$f":"+F4","v":"Moulin"}]
[]
[null,{"$f":"Impex!B20","v":""},null,{"$f":"Impex!B21","v":""},null,{"$f":"Impex!B22","v":""},null,{"$f":"Impex!B23","v":""},null," "]
[null,{"$f":"+Inv!F26","v":"MS en %"},{"$f":"IF(Inv!F28=0,\"\",Inv!F28)","v":""},{"$f":"+B7","v":"MS en %"},{"$f":"IF(Inv!F29=0,\"\",Inv!F29)","v":""},{"$f":"+B7","v":"MS en %"},{"$f":"IF(Inv!F30=0,\"\",Inv!F30)","v":""},{"$f":"+B7","v":"MS en %"},{"$f":"IF(Inv!F31=0,\"\",Inv!F31)","v":""}]
[null,{"$f":"+Textes!A106","v":"par kg d'aliment"},null,{"$f":"+B8","v":"par kg d'aliment"},null,{"$f":"+D8","v":"par kg d'aliment"},null,{"$f":"+F8","v":"par kg d'aliment"}]
[null,{"$f":"+Inv!G26","v":"MJ EDP"},{"$f":"IF(Inv!G28=0,\"\",Inv!G28)","v":""},{"$f":"B9","v":"MJ EDP"},{"$f":"IF(Inv!G29=0,\"\",Inv!G29)","v":""},{"$f":"B9","v":"MJ EDP"},{"$f":"IF(Inv!G30=0,\"\",Inv!G30)","v":""},{"$f":"B9","v":"MJ EDP"},{"$f":"IF(Inv!G31=0,\"\",Inv!G31)","v":""}]
[null,{"$f":"+Inv!H26","v":"g MA"},{"$f":"IF(Inv!H28=0,\"\",Inv!H28)","v":""},{"$f":"B10","v":"g MA"},{"$f":"IF(Inv!H29=0,\"\",Inv!H29)","v":""},{"$f":"B10","v":"g MA"},{"$f":"IF(Inv!H30=0,\"\",Inv!H30)","v":""},{"$f":"B10","v":"g MA"},{"$f":"IF(Inv!H31=0,\"\",Inv!H31)","v":""}]
[null,{"$f":"+Inv!I26","v":"g P"},{"$f":"IF(Inv!I28=0,\"\",Inv!I28)","v":""},{"$f":"B11","v":"g P"},{"$f":"IF(Inv!I29=0,\"\",Inv!I29)","v":""},{"$f":"B11","v":"g P"},{"$f":"IF(Inv!I30=0,\"\",Inv!I30)","v":""},{"$f":"B11","v":"g P"},{"$f":"IF(Inv!I31=0,\"\",Inv!I31)","v":""}]
[null,{"$f":"+Textes!A107","v":"Date"},{"$f":"+Textes!A108","v":"kg aliment"},{"$f":"+B12","v":"Date"},"kg aliment","Date","kg aliment","Date","kg aliment"]
[null,null,null,null,null,null,null,null,null,null,{"$f":"Textes!A103","v":"Entrée aliments"}]
[]
[]
[]
[]
[]
[]
[]
[]
[]
[]
[]
[]
[]
[]
[]
[]
[]
[]
[]
[]
[]
[]
[]
[]
[]
[]
[]
[]
[]
[]
[]
[]
[]
[]
[]
[]
[]
[]
[]
[]
[]
[]
[]
[]
[null,{"$f":"+Textes!A109","v":"Total entrée"},{"$f":"IF(SUM(C13:C57)=0,0,SUM(C13:C57))","v":0},{"$f":"+B58","v":"Total entrée"},{"$f":"IF(SUM(E13:E57)=0,0,SUM(E13:E57))","v":0},{"$f":"+D58","v":"Total entrée"},{"$f":"IF(SUM(G13:G57)=0,0,SUM(G13:G57))","v":0},{"$f":"+F58","v":"Total entrée"},{"$f":"IF(SUM(I13:I57)=0,0,SUM(I13:I57))","v":0}]
[]
[null,{"$f":"+Textes!A112","v":"Tous les aliments utilisés doivent être saisis."}]
[]
[null,{"$f":"+Inv!B84","v":"Organisation de contrôle, Date:"},null,null,null,{"$f":"+Inv!H84","v":"Signature:"}]
[]
[null,{"$f":"+Inv!B86","v":"Exploitant, Date:"},null,null,null,{"$f":"+Inv!H86","v":"Signature:"}]

{"sheet":"B2","index":15,"n_rows":64,"n_cols":11,"rows_kept":64,"cut":false,"hidden":false,"merged":[]}
[null,null,null,{"$f":"+A2a!D1","v":"Impex:   Production porcine"},null,null,null,null,{"$f":"\"B2: \"&K13","v":"B2: Entrée aliments"}]
[null,{"$f":"Inv!C4&IF(Inv!D4=0,\"\",Inv!D4)","v":"No cantonal:    "},null,null,null,{"$f":"Inv!C5&IF(Inv!D5=0,\"\",Inv!D6&\" \"&Inv!D5)","v":"Nom:    "}]
[]
[null,{"$f":"+'B1'!B4","v":"Moulin"},null,{"$f":"+B4","v":"Moulin"},null,{"$f":"+D4","v":"Moulin"},null,{"$f":"+F4","v":"Moulin"}]
[]
[null,{"$f":"Impex!B24","v":""},null,{"$f":"Impex!B25","v":""},null,{"$f":"Impex!B26","v":""},null,{"$f":"Impex!B27","v":""},null," "]
[null,{"$f":"+Inv!F26","v":"MS en %"},{"$f":"IF(Inv!F32=0,\"\",Inv!F32)","v":""},{"$f":"+B7","v":"MS en %"},{"$f":"IF(Inv!F33=0,\"\",Inv!F33)","v":""},{"$f":"+D7","v":"MS en %"},{"$f":"IF(Inv!F34=0,\"\",Inv!F34)","v":""},{"$f":"+F7","v":"MS en %"},{"$f":"IF(Inv!F35=0,\"\",Inv!F35)","v":""}]
[null,{"$f":"+'B1'!B8","v":"par kg d'aliment"},null,{"$f":"+B8","v":"par kg d'aliment"},null,{"$f":"+D8","v":"par kg d'aliment"},null,{"$f":"+F8","v":"par kg d'aliment"}]
[null,{"$f":"'B1'!B9","v":"MJ EDP"},{"$f":"IF(Inv!G32=0,\"\",Inv!G32)","v":""},{"$f":"'B1'!B9","v":"MJ EDP"},{"$f":"IF(Inv!G33=0,\"\",Inv!G33)","v":""},{"$f":"'B1'!B9","v":"MJ EDP"},{"$f":"IF(Inv!G34=0,\"\",Inv!G34)","v":""},{"$f":"'B1'!B9","v":"MJ EDP"},{"$f":"IF(Inv!G35=0,\"\",Inv!G35)","v":""}]
[null,{"$f":"'B1'!B10","v":"g MA"},{"$f":"IF(Inv!H32=0,\"\",Inv!H32)","v":""},{"$f":"'B1'!B10","v":"g MA"},{"$f":"IF(Inv!H33=0,\"\",Inv!H33)","v":""},{"$f":"'B1'!B10","v":"g MA"},{"$f":"IF(Inv!H34=0,\"\",Inv!H34)","v":""},{"$f":"'B1'!B10","v":"g MA"},{"$f":"IF(Inv!H35=0,\"\",Inv!H35)","v":""}]
[null,{"$f":"'B1'!B11","v":"g P"},{"$f":"IF(Inv!I32=0,\"\",Inv!I32)","v":""},{"$f":"'B1'!B11","v":"g P"},{"$f":"IF(Inv!I33=0,\"\",Inv!I33)","v":""},{"$f":"'B1'!B11","v":"g P"},{"$f":"IF(Inv!I34=0,\"\",Inv!I34)","v":""},{"$f":"'B1'!B11","v":"g P"},{"$f":"IF(Inv!I35=0,\"\",Inv!I35)","v":""}]
[null,{"$f":"+'B1'!B12","v":"Date"},{"$f":"+'B1'!C12","v":"kg aliment"},{"$f":"+B12","v":"Date"},"kg aliment","Date","kg aliment","Date","kg aliment"]
[null,null,null,null,null,null,null,null,null,null,{"$f":"Textes!A103","v":"Entrée aliments"}]
[]
[]
[]
[]
[]
[]
[]
[]
[]
[]
[]
[]
[]
[]
[]
[]
[]
[]
[]
[]
[]
[]
[]
[]
[]
[]
[]
[]
[]
[]
[]
[]
[]
[]
[]
[]
[]
[]
[]
[]
[]
[]
[]
[]
[null,{"$f":"+'B1'!B58","v":"Total entrée"},{"$f":"IF(SUM(C13:C57)=0,0,SUM(C13:C57))","v":0},{"$f":"+B58","v":"Total entrée"},{"$f":"IF(SUM(E13:E57)=0,0,SUM(E13:E57))","v":0},{"$f":"+D58","v":"Total entrée"},{"$f":"IF(SUM(G13:G57)=0,0,SUM(G13:G57))","v":0},{"$f":"+F58","v":"Total entrée"},{"$f":"IF(SUM(I13:I57)=0,0,SUM(I13:I57))","v":0}]
[]
[null,{"$f":"+'B1'!B60","v":"Tous les aliments utilisés doivent être saisis."}]
[]
[null,{"$f":"+Inv!B84","v":"Organisation de contrôle, Date:"},null,null,null,{"$f":"+Inv!H84","v":"Signature:"}]
[]
[null,{"$f":"+Inv!B86","v":"Exploitant, Date:"},null,null,null,{"$f":"+Inv!H86","v":"Signature:"}]

{"sheet":"B3","index":16,"n_rows":64,"n_cols":11,"rows_kept":64,"cut":false,"hidden":false,"merged":[]}
[null,null,null,{"$f":"+A2a!D1","v":"Impex:   Production porcine"},null,null,null,null,{"$f":"\"B3: \"&K13","v":"B3: Entrée aliments"}]
[null,{"$f":"Inv!C4&IF(Inv!D4=0,\"\",Inv!D4)","v":"No cantonal:    "},null,null,null,{"$f":"Inv!C5&IF(Inv!D5=0,\"\",Inv!D6&\" \"&Inv!D5)","v":"Nom:    "}]
[]
[null,{"$f":"+'B2'!B4","v":"Moulin"},null,{"$f":"+B4","v":"Moulin"},null,{"$f":"+D4","v":"Moulin"},null,{"$f":"+F4","v":"Moulin"}]
[]
[null,{"$f":"Impex!B28","v":""},null,{"$f":"Impex!B29","v":""},null,{"$f":"Impex!B30","v":""},null,{"$f":"Impex!B31","v":""},null," "]
[null,{"$f":"+'B2'!B7","v":"MS en %"},{"$f":"IF(Inv!F36=0,\"\",Inv!F36)","v":""},{"$f":"+B7","v":"MS en %"},{"$f":"IF(Inv!F37=0,\"\",Inv!F37)","v":""},{"$f":"+B7","v":"MS en %"},{"$f":"IF(Inv!F38=0,\"\",Inv!F38)","v":""},{"$f":"+B7","v":"MS en %"},{"$f":"IF(Inv!F39=0,\"\",Inv!F39)","v":""}]
[null,{"$f":"+'B2'!B8","v":"par kg d'aliment"},null,{"$f":"+B8","v":"par kg d'aliment"},null,{"$f":"+D8","v":"par kg d'aliment"},null,{"$f":"+F8","v":"par kg d'aliment"}]
[null,{"$f":"'B1'!B9","v":"MJ EDP"},{"$f":"IF(Inv!G36=0,\"\",Inv!G36)","v":""},{"$f":"'B1'!B9","v":"MJ EDP"},{"$f":"IF(Inv!G37=0,\"\",Inv!G37)","v":""},{"$f":"'B1'!B9","v":"MJ EDP"},{"$f":"IF(Inv!G38=0,\"\",Inv!G38)","v":""},{"$f":"'B1'!B9","v":"MJ EDP"},{"$f":"IF(Inv!G39=0,\"\",Inv!G39)","v":""}]
[null,{"$f":"'B1'!B10","v":"g MA"},{"$f":"IF(Inv!H36=0,\"\",Inv!H36)","v":""},{"$f":"'B1'!B10","v":"g MA"},{"$f":"IF(Inv!H37=0,\"\",Inv!H37)","v":""},{"$f":"'B1'!B10","v":"g MA"},{"$f":"IF(Inv!H38=0,\"\",Inv!H38)","v":""},{"$f":"'B1'!B10","v":"g MA"},{"$f":"IF(Inv!H39=0,\"\",Inv!H39)","v":""}]
[null,{"$f":"'B1'!B11","v":"g P"},{"$f":"IF(Inv!I36=0,\"\",Inv!I36)","v":""},{"$f":"'B1'!B11","v":"g P"},{"$f":"IF(Inv!I37=0,\"\",Inv!I37)","v":""},{"$f":"'B1'!B11","v":"g P"},{"$f":"IF(Inv!I38=0,\"\",Inv!I38)","v":""},{"$f":"'B1'!B11","v":"g P"},{"$f":"IF(Inv!I39=0,\"\",Inv!I39)","v":""}]
[null,{"$f":"+'B2'!B12","v":"Date"},{"$f":"+'B2'!C12","v":"kg aliment"},{"$f":"+B12","v":"Date"},"kg aliment","Date","kg aliment","Date","kg aliment"]
[null,null,null,null,null,null,null,null,null,null,{"$f":"Textes!A103","v":"Entrée aliments"}]
[]
[]
[]
[]
[]
[]
[]
[]
[]
[]
[]
[]
[]
[]
[]
[]
[]
[]
[]
[]
[]
[]
[]
[]
[]
[]
[]
[]
[]
[]
[]
[]
[]
[]
[]
[]
[]
[]
[]
[]
[]
[]
[]
[]
[null,{"$f":"+'B2'!B58","v":"Total entrée"},{"$f":"IF(SUM(C13:C57)=0,0,SUM(C13:C57))","v":0},{"$f":"+B58","v":"Total entrée"},{"$f":"IF(SUM(E13:E57)=0,0,SUM(E13:E57))","v":0},{"$f":"+D58","v":"Total entrée"},{"$f":"IF(SUM(G13:G57)=0,0,SUM(G13:G57))","v":0},{"$f":"+F58","v":"Total entrée"},{"$f":"IF(SUM(I13:I57)=0,0,SUM(I13:I57))","v":0}]
[]
[null,{"$f":"+'B1'!B60","v":"Tous les aliments utilisés doivent être saisis."}]
[]
[null,{"$f":"+Inv!B84","v":"Organisation de contrôle, Date:"},null,null,null,{"$f":"+Inv!H84","v":"Signature:"}]
[]
[null,{"$f":"+Inv!B86","v":"Exploitant, Date:"},null,null,null,{"$f":"+Inv!H86","v":"Signature:"}]

{"sheet":"B4","index":17,"n_rows":64,"n_cols":11,"rows_kept":64,"cut":false,"hidden":false,"merged":[]}
[null,null,null,{"$f":"+A2a!D1","v":"Impex:   Production porcine"},null,null,null,null,{"$f":"\"B4: \"&K13","v":"B4: Entrée aliments"}]
[null,{"$f":"Inv!C4&IF(Inv!D4=0,\"\",Inv!D4)","v":"No cantonal:    "},null,null,null,{"$f":"Inv!C5&IF(Inv!D5=0,\"\",Inv!D6&\" \"&Inv!D5)","v":"Nom:    "}]
[]
[null,{"$f":"+'B2'!B4","v":"Moulin"},null,{"$f":"+B4","v":"Moulin"},null,{"$f":"+D4","v":"Moulin"},null,{"$f":"+F4","v":"Moulin"}]
[]
[null,{"$f":"Impex!B32","v":""},null,{"$f":"Impex!B33","v":""},null,{"$f":"Impex!B34","v":""},null,{"$f":"Impex!B35","v":""},null," "]
[null,{"$f":"+'B2'!B7","v":"MS en %"},{"$f":"IF(Inv!F40=0,\"\",Inv!F40)","v":""},{"$f":"+B7","v":"MS en %"},{"$f":"IF(Inv!F41=0,\"\",Inv!F41)","v":""},{"$f":"+B7","v":"MS en %"},{"$f":"IF(Inv!F42=0,\"\",Inv!F42)","v":""},{"$f":"+B7","v":"MS en %"},{"$f":"IF(Inv!F43=0,\"\",Inv!F43)","v":""}]
[null,{"$f":"+'B2'!B8","v":"par kg d'aliment"},null,{"$f":"+B8","v":"par kg d'aliment"},null,{"$f":"+D8","v":"par kg d'aliment"},null,{"$f":"+F8","v":"par kg d'aliment"}]
[null,{"$f":"'B1'!B9","v":"MJ EDP"},{"$f":"IF(Inv!G40=0,\"\",Inv!G40)","v":""},{"$f":"'B1'!B9","v":"MJ EDP"},{"$f":"IF(Inv!G41=0,\"\",Inv!G41)","v":""},{"$f":"'B1'!B9","v":"MJ EDP"},{"$f":"IF(Inv!G42=0,\"\",Inv!G42)","v":""},{"$f":"'B1'!B9","v":"MJ EDP"},{"$f":"IF(Inv!G43=0,\"\",Inv!G43)","v":""}]
[null,{"$f":"'B1'!B10","v":"g MA"},{"$f":"IF(Inv!H40=0,\"\",Inv!H40)","v":""},{"$f":"'B1'!B10","v":"g MA"},{"$f":"IF(Inv!H41=0,\"\",Inv!H41)","v":""},{"$f":"'B1'!B10","v":"g MA"},{"$f":"IF(Inv!H42=0,\"\",Inv!H42)","v":""},{"$f":"'B1'!B10","v":"g MA"},{"$f":"IF(Inv!H43=0,\"\",Inv!H43)","v":""}]
[null,{"$f":"'B1'!B11","v":"g P"},{"$f":"IF(Inv!I40=0,\"\",Inv!I40)","v":""},{"$f":"'B1'!B11","v":"g P"},{"$f":"IF(Inv!I41=0,\"\",Inv!I41)","v":""},{"$f":"'B1'!B11","v":"g P"},{"$f":"IF(Inv!I42=0,\"\",Inv!I42)","v":""},{"$f":"'B1'!B11","v":"g P"},{"$f":"IF(Inv!I43=0,\"\",Inv!I43)","v":""}]
[null,{"$f":"+'B2'!B12","v":"Date"},{"$f":"+'B2'!C12","v":"kg aliment"},{"$f":"+B12","v":"Date"},"kg aliment","Date","kg aliment","Date","kg aliment"]
[null,null,null,null,null,null,null,null,null,null,{"$f":"Textes!A103","v":"Entrée aliments"}]
[]
[]
[]
[]
[]
[]
[]
[]
[]
[]
[]
[]
[]
[]
[]
[]
[]
[]
[]
[]
[]
[]
[]
[]
[]
[]
[]
[]
[]
[]
[]
[]
[]
[]
[]
[]
[]
[]
[]
[]
[]
[]
[]
[]
[null,{"$f":"+'B2'!B58","v":"Total entrée"},{"$f":"IF(SUM(C13:C57)=0,0,SUM(C13:C57))","v":0},{"$f":"+B58","v":"Total entrée"},{"$f":"IF(SUM(E13:E57)=0,0,SUM(E13:E57))","v":0},{"$f":"+D58","v":"Total entrée"},{"$f":"IF(SUM(G13:G57)=0,0,SUM(G13:G57))","v":0},{"$f":"+F58","v":"Total entrée"},{"$f":"IF(SUM(I13:I57)=0,0,SUM(I13:I57))","v":0}]
[]
[null,{"$f":"+'B1'!B60","v":"Tous les aliments utilisés doivent être saisis."}]
[]
[null,{"$f":"+Inv!B84","v":"Organisation de contrôle, Date:"},null,null,null,{"$f":"+Inv!H84","v":"Signature:"}]
[]
[null,{"$f":"+Inv!B86","v":"Exploitant, Date:"},null,null,null,{"$f":"+Inv!H86","v":"Signature:"}]

{"sheet":"BX1","index":18,"n_rows":64,"n_cols":11,"rows_kept":64,"cut":false,"hidden":true,"merged":[]}
[null,null,null,{"$f":"+A2a!D1","v":"Impex:   Production porcine"},null,null,null,null,{"$f":"\"BX1: \"&K13","v":"BX1: Entrée aliments"}]
[null,{"$f":"Inv!C4&IF(Inv!D4=0,\"\",Inv!D4)","v":"No cantonal:    "},null,null,null,{"$f":"Inv!C5&IF(Inv!D5=0,\"\",Inv!D6&\" \"&Inv!D5)","v":"Nom:    "}]
[]
[null,{"$f":"+Textes!A105","v":"Moulin"},null,{"$f":"+B4","v":"Moulin"},null,{"$f":"+D4","v":"Moulin"},null,{"$f":"+F4","v":"Moulin"}]
[]
[null,{"$f":"Impex!B36","v":""},null,{"$f":"Impex!B37","v":""},null,{"$f":"Impex!B38","v":""},null,{"$f":"Impex!B39","v":""},null," "]
[null,{"$f":"+Inv!F26","v":"MS en %"},{"$f":"IF(Inv!F44=0,\"\",Inv!F44)","v":""},{"$f":"+B7","v":"MS en %"},{"$f":"IF(Inv!F45=0,\"\",Inv!F45)","v":""},{"$f":"+B7","v":"MS en %"},{"$f":"IF(Inv!F46=0,\"\",Inv!F46)","v":""},{"$f":"+B7","v":"MS en %"},{"$f":"IF(Inv!F47=0,\"\",Inv!F47)","v":""}]
[null,{"$f":"+Textes!A106","v":"par kg d'aliment"},null,{"$f":"+B8","v":"par kg d'aliment"},null,{"$f":"+D8","v":"par kg d'aliment"},null,{"$f":"+F8","v":"par kg d'aliment"}]
[null,{"$f":"+Inv!G26","v":"MJ EDP"},{"$f":"IF(Inv!G44=0,\"\",Inv!G44)","v":""},{"$f":"B9","v":"MJ EDP"},{"$f":"IF(Inv!G45=0,\"\",Inv!G45)","v":""},{"$f":"B9","v":"MJ EDP"},{"$f":"IF(Inv!G46=0,\"\",Inv!G46)","v":""},{"$f":"B9","v":"MJ EDP"},{"$f":"IF(Inv!G47=0,\"\",Inv!G47)","v":""}]
[null,{"$f":"+Inv!H26","v":"g MA"},{"$f":"IF(Inv!H44=0,\"\",Inv!H44)","v":""},{"$f":"B10","v":"g MA"},{"$f":"IF(Inv!H45=0,\"\",Inv!H45)","v":""},{"$f":"B10","v":"g MA"},{"$f":"IF(Inv!H46=0,\"\",Inv!H46)","v":""},{"$f":"B10","v":"g MA"},{"$f":"IF(Inv!H47=0,\"\",Inv!H47)","v":""}]
[null,{"$f":"+Inv!I26","v":"g P"},{"$f":"IF(Inv!I44=0,\"\",Inv!I44)","v":""},{"$f":"B11","v":"g P"},{"$f":"IF(Inv!I45=0,\"\",Inv!I45)","v":""},{"$f":"B11","v":"g P"},{"$f":"IF(Inv!I46=0,\"\",Inv!I46)","v":""},{"$f":"B11","v":"g P"},{"$f":"IF(Inv!I47=0,\"\",Inv!I47)","v":""}]
[null,{"$f":"+Textes!A107","v":"Date"},{"$f":"+Textes!A108","v":"kg aliment"},{"$f":"+B12","v":"Date"},"kg aliment","Date","kg aliment","Date","kg aliment"]
[null,null,null,null,null,null,null,null,null,null,{"$f":"Textes!A103","v":"Entrée aliments"}]
[]
[]
[]
[]
[]
[]
[]
[]
[]
[]
[]
[]
[]
[]
[]
[]
[]
[]
[]
[]
[]
[]
[]
[]
[]
[]
[]
[]
[]
[]
[]
[]
[]
[]
[]
[]
[]
[]
[]
[]
[]
[]
[]
[]
[null,{"$f":"+Textes!A109","v":"Total entrée"},{"$f":"IF(SUM(C13:C57)=0,0,SUM(C13:C57))","v":0},{"$f":"+B58","v":"Total entrée"},{"$f":"IF(SUM(E13:E57)=0,0,SUM(E13:E57))","v":0},{"$f":"+D58","v":"Total entrée"},{"$f":"IF(SUM(G13:G57)=0,0,SUM(G13:G57))","v":0},{"$f":"+F58","v":"Total entrée"},{"$f":"IF(SUM(I13:I57)=0,0,SUM(I13:I57))","v":0}]
[]
[null,{"$f":"+Textes!A112","v":"Tous les aliments utilisés doivent être saisis."}]
[]
[null,{"$f":"+Inv!B84","v":"Organisation de contrôle, Date:"},null,null,null,{"$f":"+Inv!H84","v":"Signature:"}]
[]
[null,{"$f":"+Inv!B86","v":"Exploitant, Date:"},null,null,null,{"$f":"+Inv!H86","v":"Signature:"}]

{"sheet":"BX2","index":19,"n_rows":64,"n_cols":11,"rows_kept":64,"cut":false,"hidden":true,"merged":[]}
[null,null,null,{"$f":"+A2a!D1","v":"Impex:   Production porcine"},null,null,null,null,{"$f":"\"BX2: \"&K13","v":"BX2: Entrée aliments"}]
[null,{"$f":"Inv!C4&IF(Inv!D4=0,\"\",Inv!D4)","v":"No cantonal:    "},null,null,null,{"$f":"Inv!C5&IF(Inv!D5=0,\"\",Inv!D6&\" \"&Inv!D5)","v":"Nom:    "}]
[]
[null,{"$f":"+'BX1'!B4","v":"Moulin"},null,{"$f":"+B4","v":"Moulin"},null,{"$f":"+D4","v":"Moulin"},null,{"$f":"+F4","v":"Moulin"}]
[]
[null,{"$f":"Impex!B40","v":""},null,{"$f":"Impex!B41","v":""},null,{"$f":"Impex!B42","v":""},null,{"$f":"Impex!B43","v":""},null," "]
[null,{"$f":"+Inv!F26","v":"MS en %"},{"$f":"IF(Inv!F48=0,\"\",Inv!F48)","v":""},{"$f":"+B7","v":"MS en %"},{"$f":"IF(Inv!F49=0,\"\",Inv!F49)","v":""},{"$f":"+D7","v":"MS en %"},{"$f":"IF(Inv!F50=0,\"\",Inv!F50)","v":""},{"$f":"+F7","v":"MS en %"},{"$f":"IF(Inv!F51=0,\"\",Inv!F51)","v":""}]
[null,{"$f":"+'BX1'!B8","v":"par kg d'aliment"},null,{"$f":"+B8","v":"par kg d'aliment"},null,{"$f":"+D8","v":"par kg d'aliment"},null,{"$f":"+F8","v":"par kg d'aliment"}]
[null,{"$f":"'BX1'!B9","v":"MJ EDP"},{"$f":"IF(Inv!G48=0,\"\",Inv!G48)","v":""},{"$f":"'BX1'!B9","v":"MJ EDP"},{"$f":"IF(Inv!G49=0,\"\",Inv!G49)","v":""},{"$f":"'BX1'!B9","v":"MJ EDP"},{"$f":"IF(Inv!G50=0,\"\",Inv!G50)","v":""},{"$f":"'BX1'!B9","v":"MJ EDP"},{"$f":"IF(Inv!G51=0,\"\",Inv!G51)","v":""}]
[null,{"$f":"'BX1'!B10","v":"g MA"},{"$f":"IF(Inv!H48=0,\"\",Inv!H48)","v":""},{"$f":"'BX1'!B10","v":"g MA"},{"$f":"IF(Inv!H49=0,\"\",Inv!H49)","v":""},{"$f":"'BX1'!B10","v":"g MA"},{"$f":"IF(Inv!H50=0,\"\",Inv!H50)","v":""},{"$f":"'BX1'!B10","v":"g MA"},{"$f":"IF(Inv!H51=0,\"\",Inv!H51)","v":""}]
[null,{"$f":"'BX1'!B11","v":"g P"},{"$f":"IF(Inv!I48=0,\"\",Inv!I48)","v":""},{"$f":"'BX1'!B11","v":"g P"},{"$f":"IF(Inv!I49=0,\"\",Inv!I49)","v":""},{"$f":"'BX1'!B11","v":"g P"},{"$f":"IF(Inv!I50=0,\"\",Inv!I50)","v":""},{"$f":"'BX1'!B11","v":"g P"},{"$f":"IF(Inv!I51=0,\"\",Inv!I51)","v":""}]
[null,{"$f":"+'BX1'!B12","v":"Date"},{"$f":"+'BX1'!C12","v":"kg aliment"},{"$f":"+B12","v":"Date"},"kg aliment","Date","kg aliment","Date","kg aliment"]
[null,null,null,null,null,null,null,null,null,null,{"$f":"Textes!A103","v":"Entrée aliments"}]
[]
[]
[]
[]
[]
[]
[]
[]
[]
[]
[]
[]
[]
[]
[]
[]
[]
[]
[]
[]
[]
[]
[]
[]
[]
[]
[]
[]
[]
[]
[]
[]
[]
[]
[]
[]
[]
[]
[]
[]
[]
[]
[]
[]
[null,{"$f":"+'BX1'!B58","v":"Total entrée"},{"$f":"IF(SUM(C13:C57)=0,0,SUM(C13:C57))","v":0},{"$f":"+B58","v":"Total entrée"},{"$f":"IF(SUM(E13:E57)=0,0,SUM(E13:E57))","v":0},{"$f":"+D58","v":"Total entrée"},{"$f":"IF(SUM(G13:G57)=0,0,SUM(G13:G57))","v":0},{"$f":"+F58","v":"Total entrée"},{"$f":"IF(SUM(I13:I57)=0,0,SUM(I13:I57))","v":0}]
[]
[null,{"$f":"+'BX1'!B60","v":"Tous les aliments utilisés doivent être saisis."}]
[]
[null,{"$f":"+Inv!B84","v":"Organisation de contrôle, Date:"},null,null,null,{"$f":"+Inv!H84","v":"Signature:"}]
[]
[null,{"$f":"+Inv!B86","v":"Exploitant, Date:"},null,null,null,{"$f":"+Inv!H86","v":"Signature:"}]

{"sheet":"BX3","index":20,"n_rows":64,"n_cols":11,"rows_kept":64,"cut":false,"hidden":true,"merged":[]}
[null,null,null,{"$f":"+A2a!D1","v":"Impex:   Production porcine"},null,null,null,null,{"$f":"\"BX3: \"&K13","v":"BX3: Entrée aliments"}]
[null,{"$f":"Inv!C4&IF(Inv!D4=0,\"\",Inv!D4)","v":"No cantonal:    "},null,null,null,{"$f":"Inv!C5&IF(Inv!D5=0,\"\",Inv!D6&\" \"&Inv!D5)","v":"Nom:    "}]
[]
[null,{"$f":"+'BX2'!B4","v":"Moulin"},null,{"$f":"+B4","v":"Moulin"},null,{"$f":"+D4","v":"Moulin"},null,{"$f":"+F4","v":"Moulin"}]
[]
[null,{"$f":"Impex!B44","v":""},null,{"$f":"Impex!B45","v":""},null,{"$f":"Impex!B46","v":""},null,{"$f":"Impex!B47","v":""},null," "]
[null,{"$f":"+'BX2'!B7","v":"MS en %"},{"$f":"IF(Inv!F52=0,\"\",Inv!F52)","v":""},{"$f":"+B7","v":"MS en %"},{"$f":"IF(Inv!F53=0,\"\",Inv!F53)","v":""},{"$f":"+B7","v":"MS en %"},{"$f":"IF(Inv!F54=0,\"\",Inv!F54)","v":""},{"$f":"+B7","v":"MS en %"},{"$f":"IF(Inv!F55=0,\"\",Inv!F55)","v":""}]
[null,{"$f":"+'BX2'!B8","v":"par kg d'aliment"},null,{"$f":"+B8","v":"par kg d'aliment"},null,{"$f":"+D8","v":"par kg d'aliment"},null,{"$f":"+F8","v":"par kg d'aliment"}]
[null,{"$f":"'BX1'!B9","v":"MJ EDP"},{"$f":"IF(Inv!G52=0,\"\",Inv!G52)","v":""},{"$f":"'BX1'!B9","v":"MJ EDP"},{"$f":"IF(Inv!G53=0,\"\",Inv!G53)","v":""},{"$f":"'BX1'!B9","v":"MJ EDP"},{"$f":"IF(Inv!G54=0,\"\",Inv!G54)","v":""},{"$f":"'BX1'!B9","v":"MJ EDP"},{"$f":"IF(Inv!G55=0,\"\",Inv!G55)","v":""}]
[null,{"$f":"'BX1'!B10","v":"g MA"},{"$f":"IF(Inv!H52=0,\"\",Inv!H52)","v":""},{"$f":"'BX1'!B10","v":"g MA"},{"$f":"IF(Inv!H53=0,\"\",Inv!H53)","v":""},{"$f":"'BX1'!B10","v":"g MA"},{"$f":"IF(Inv!H54=0,\"\",Inv!H54)","v":""},{"$f":"'BX1'!B10","v":"g MA"},{"$f":"IF(Inv!H55=0,\"\",Inv!H55)","v":""}]
[null,{"$f":"'BX1'!B11","v":"g P"},{"$f":"IF(Inv!I52=0,\"\",Inv!I52)","v":""},{"$f":"'BX1'!B11","v":"g P"},{"$f":"IF(Inv!I53=0,\"\",Inv!I53)","v":""},{"$f":"'BX1'!B11","v":"g P"},{"$f":"IF(Inv!I54=0,\"\",Inv!I54)","v":""},{"$f":"'BX1'!B11","v":"g P"},{"$f":"IF(Inv!I55=0,\"\",Inv!I55)","v":""}]
[null,{"$f":"+'BX2'!B12","v":"Date"},{"$f":"+'BX2'!C12","v":"kg aliment"},{"$f":"+B12","v":"Date"},"kg aliment","Date","kg aliment","Date","kg aliment"]
[null,null,null,null,null,null,null,null,null,null,{"$f":"Textes!A103","v":"Entrée aliments"}]
[]
[]
[]
[]
[]
[]
[]
[]
[]
[]
[]
[]
[]
[]
[]
[]
[]
[]
[]
[]
[]
[]
[]
[]
[]
[]
[]
[]
[]
[]
[]
[]
[]
[]
[]
[]
[]
[]
[]
[]
[]
[]
[]
[]
[null,{"$f":"+'BX2'!B58","v":"Total entrée"},{"$f":"IF(SUM(C13:C57)=0,0,SUM(C13:C57))","v":0},{"$f":"+B58","v":"Total entrée"},{"$f":"IF(SUM(E13:E57)=0,0,SUM(E13:E57))","v":0},{"$f":"+D58","v":"Total entrée"},{"$f":"IF(SUM(G13:G57)=0,0,SUM(G13:G57))","v":0},{"$f":"+F58","v":"Total entrée"},{"$f":"IF(SUM(I13:I57)=0,0,SUM(I13:I57))","v":0}]
[]
[null,{"$f":"+'BX1'!B60","v":"Tous les aliments utilisés doivent être saisis."}]
[]
[null,{"$f":"+Inv!B84","v":"Organisation de contrôle, Date:"},null,null,null,{"$f":"+Inv!H84","v":"Signature:"}]
[]
[null,{"$f":"+Inv!B86","v":"Exploitant, Date:"},null,null,null,{"$f":"+Inv!H86","v":"Signature:"}]

{"sheet":"BX4","index":21,"n_rows":64,"n_cols":11,"rows_kept":64,"cut":false,"hidden":true,"merged":[]}
[null,null,null,{"$f":"+A2a!D1","v":"Impex:   Production porcine"},null,null,null,null,{"$f":"\"BX4: \"&K13","v":"BX4: Entrée aliments"}]
[null,{"$f":"Inv!C4&IF(Inv!D4=0,\"\",Inv!D4)","v":"No cantonal:    "},null,null,null,{"$f":"Inv!C5&IF(Inv!D5=0,\"\",Inv!D6&\" \"&Inv!D5)","v":"Nom:    "}]
[]
[null,{"$f":"+'BX2'!B4","v":"Moulin"},null,{"$f":"+B4","v":"Moulin"},null,{"$f":"+D4","v":"Moulin"},null,{"$f":"+F4","v":"Moulin"}]
[]
[null,{"$f":"Impex!B48","v":""},null,{"$f":"Impex!B49","v":""},null,{"$f":"Impex!B50","v":""},null,{"$f":"Impex!B51","v":""},null," "]
[null,{"$f":"+'BX2'!B7","v":"MS en %"},{"$f":"IF(Inv!F56=0,\"\",Inv!F56)","v":""},{"$f":"+B7","v":"MS en %"},{"$f":"IF(Inv!F57=0,\"\",Inv!F57)","v":""},{"$f":"+B7","v":"MS en %"},{"$f":"IF(Inv!F58=0,\"\",Inv!F58)","v":""},{"$f":"+B7","v":"MS en %"},{"$f":"IF(Inv!F59=0,\"\",Inv!F59)","v":""}]
[null,{"$f":"+'BX2'!B8","v":"par kg d'aliment"},null,{"$f":"+B8","v":"par kg d'aliment"},null,{"$f":"+D8","v":"par kg d'aliment"},null,{"$f":"+F8","v":"par kg d'aliment"}]
[null,{"$f":"'BX1'!B9","v":"MJ EDP"},{"$f":"IF(Inv!G56=0,\"\",Inv!G56)","v":""},{"$f":"'BX1'!B9","v":"MJ EDP"},{"$f":"IF(Inv!G57=0,\"\",Inv!G57)","v":""},{"$f":"'BX1'!B9","v":"MJ EDP"},{"$f":"IF(Inv!G58=0,\"\",Inv!G58)","v":""},{"$f":"'BX1'!B9","v":"MJ EDP"},{"$f":"IF(Inv!G59=0,\"\",Inv!G59)","v":""}]
[null,{"$f":"'BX1'!B10","v":"g MA"},{"$f":"IF(Inv!H56=0,\"\",Inv!H56)","v":""},{"$f":"'BX1'!B10","v":"g MA"},{"$f":"IF(Inv!H57=0,\"\",Inv!H57)","v":""},{"$f":"'BX1'!B10","v":"g MA"},{"$f":"IF(Inv!H58=0,\"\",Inv!H58)","v":""},{"$f":"'BX1'!B10","v":"g MA"},{"$f":"IF(Inv!H59=0,\"\",Inv!H59)","v":""}]
[null,{"$f":"'BX1'!B11","v":"g P"},{"$f":"IF(Inv!I56=0,\"\",Inv!I56)","v":""},{"$f":"'BX1'!B11","v":"g P"},{"$f":"IF(Inv!I57=0,\"\",Inv!I57)","v":""},{"$f":"'BX1'!B11","v":"g P"},{"$f":"IF(Inv!I58=0,\"\",Inv!I58)","v":""},{"$f":"'BX1'!B11","v":"g P"},{"$f":"IF(Inv!I59=0,\"\",Inv!I59)","v":""}]
[null,{"$f":"+'BX2'!B12","v":"Date"},{"$f":"+'BX2'!C12","v":"kg aliment"},{"$f":"+B12","v":"Date"},"kg aliment","Date","kg aliment","Date","kg aliment"]
[null,null,null,null,null,null,null,null,null,null,{"$f":"Textes!A103","v":"Entrée aliments"}]
[]
[]
[]
[]
[]
[]
[]
[]
[]
[]
[]
[]
[]
[]
[]
[]
[]
[]
[]
[]
[]
[]
[]
[]
[]
[]
[]
[]
[]
[]
[]
[]
[]
[]
[]
[]
[]
[]
[]
[]
[]
[]
[]
[]
[null,{"$f":"+'BX2'!B58","v":"Total entrée"},{"$f":"IF(SUM(C13:C57)=0,0,SUM(C13:C57))","v":0},{"$f":"+B58","v":"Total entrée"},{"$f":"IF(SUM(E13:E57)=0,0,SUM(E13:E57))","v":0},{"$f":"+D58","v":"Total entrée"},{"$f":"IF(SUM(G13:G57)=0,0,SUM(G13:G57))","v":0},{"$f":"+F58","v":"Total entrée"},{"$f":"IF(SUM(I13:I57)=0,0,SUM(I13:I57))","v":0}]
[]
[null,{"$f":"+'BX1'!B60","v":"Tous les aliments utilisés doivent être saisis."}]
[]
[null,{"$f":"+Inv!B84","v":"Organisation de contrôle, Date:"},null,null,null,{"$f":"+Inv!H84","v":"Signature:"}]
[]
[null,{"$f":"+Inv!B86","v":"Exploitant, Date:"},null,null,null,{"$f":"+Inv!H86","v":"Signature:"}]

{"sheet":"B5","index":22,"n_rows":64,"n_cols":11,"rows_kept":64,"cut":false,"hidden":false,"merged":[]}
[null,null,null,{"$f":"+A2a!D1","v":"Impex:   Production porcine"},null,null,null,null,{"$f":"\"B5: \" & K11","v":"B5: Entrée aliments"}]
[null,{"$f":"Inv!C4&IF(Inv!D4=0,\"\",Inv!D4)","v":"No cantonal:    "},null,null,null,{"$f":"Inv!C5&IF(Inv!D5=0,\"\",Inv!D6&\" \"&Inv!D5)","v":"Nom:    "}]
[]
[null,{"$f":"Impex!B53","v":""},null,{"$f":"Impex!B54","v":""},null,{"$f":"Impex!B55","v":""},null,{"$f":"Impex!B56","v":""},null," "]
[null,{"$f":"+Inv!F26","v":"MS en %"},{"$f":"IF(Inv!F64=0,\"\",Inv!F64)","v":""},{"$f":"+B5","v":"MS en %"},{"$f":"IF(Inv!F65=0,\"\",Inv!F65)","v":""},{"$f":"+D5","v":"MS en %"},{"$f":"IF(Inv!F66=0,\"\",Inv!F66)","v":""},{"$f":"+F5","v":"MS en %"},{"$f":"IF(Inv!F67=0,\"\",Inv!F67)","v":""}]
[null,{"$f":"+Textes!A116","v":"par kg MS"},null,{"$f":"+B6","v":"par kg MS"},null,{"$f":"+D6","v":"par kg MS"},null,{"$f":"+F6","v":"par kg MS"}]
[null,{"$f":"'B1'!B9","v":"MJ EDP"},{"$f":"IF(Inv!G64=0,\"\",Inv!G64)","v":""},{"$f":"'B1'!B9","v":"MJ EDP"},{"$f":"IF(Inv!G65=0,\"\",Inv!G65)","v":""},{"$f":"'B1'!B9","v":"MJ EDP"},{"$f":"IF(Inv!G66=0,\"\",Inv!G66)","v":""},{"$f":"'B1'!B9","v":"MJ EDP"},{"$f":"IF(Inv!G67=0,\"\",Inv!G67)","v":""}]
[null,{"$f":"'B1'!B10","v":"g MA"},{"$f":"IF(Inv!H64=0,\"\",Inv!H64)","v":""},{"$f":"'B1'!B10","v":"g MA"},{"$f":"IF(Inv!H65=0,\"\",Inv!H65)","v":""},{"$f":"'B1'!B10","v":"g MA"},{"$f":"IF(Inv!H66=0,\"\",Inv!H66)","v":""},{"$f":"'B1'!B10","v":"g MA"},{"$f":"IF(Inv!H67=0,\"\",Inv!H67)","v":""}]
[null,{"$f":"'B1'!B11","v":"g P"},{"$f":"IF(Inv!I64=0,\"\",Inv!I64)","v":""},{"$f":"'B1'!B11","v":"g P"},{"$f":"IF(Inv!I65=0,\"\",Inv!I65)","v":""},{"$f":"'B1'!B11","v":"g P"},{"$f":"IF(Inv!I66=0,\"\",Inv!I66)","v":""},{"$f":"'B1'!B11","v":"g P"},{"$f":"IF(Inv!I67=0,\"\",Inv!I67)","v":""}]
[null,{"$f":"+Textes!A107","v":"Date"},{"$f":"+Textes!A115","v":"kg MF"},{"$f":"+B10","v":"Date"},"kg MF","Date","kg MF","Date","kg MF"]
[null,null,null,null,null,null,null,null,null,null,{"$f":"Textes!A104","v":"Entrée aliments"}]
[]
[]
[]
[]
[]
[]
[]
[]
[]
[]
[]
[]
[]
[]
[]
[]
[]
[]
[]
[]
[]
[]
[]
[]
[]
[]
[]
[]
[]
[]
[]
[]
[]
[]
[]
[]
[]
[]
[]
[]
[]
[]
[]
[]
[]
[]
[null,{"$f":"+Textes!A113","v":"En kg MF"},{"$f":"IF(SUM(C11:C57)=0,0,SUM(C11:C57))","v":0},{"$f":"+B58","v":"En kg MF"},{"$f":"IF(SUM(E11:E57)=0,0,SUM(E11:E57))","v":0},{"$f":"+D58","v":"En kg MF"},{"$f":"IF(SUM(G11:G57)=0,0,SUM(G11:G57))","v":0},{"$f":"+F58","v":"En kg MF"},{"$f":"IF(SUM(I11:I57)=0,0,SUM(I11:I57))","v":0}]
[null,{"$f":"+Textes!A114","v":"En kg MS"},{"$f":"IF(SUM(C11:C57)=0,0,SUM(C11:C57)*C5/100)","v":0},{"$f":"+B59","v":"En kg MS"},{"$f":"IF(SUM(E11:E57)=0,0,(SUM(E11:E57)*E5/100))","v":0},{"$f":"+D59","v":"En kg MS"},{"$f":"IF(SUM(G11:G57)=0,0,SUM(G11:G57)*G5/100)","v":0},{"$f":"+F59","v":"En kg MS"},{"$f":"IF(SUM(I11:I57)=0,0,SUM(I11:I57)*I5/100)","v":0}]
[null,{"$f":"+'B3'!B60","v":"Tous les aliments utilisés doivent être saisis."}]
[]
[null,{"$f":"+Inv!B84","v":"Organisation de contrôle, Date:"},null,null,null,{"$f":"+Inv!H84","v":"Signature:"}]
[]
[null,{"$f":"+Inv!B86","v":"Exploitant, Date:"},null,null,null,{"$f":"+F62","v":"Signature:"}]

{"sheet":"BX5","index":23,"n_rows":64,"n_cols":11,"rows_kept":64,"cut":false,"hidden":true,"merged":[]}
[null,null,null,{"$f":"+A2a!D1","v":"Impex:   Production porcine"},null,null,null,null,{"$f":"\"BX5: \" & K11","v":"BX5: Entrée aliments"}]
[null,{"$f":"Inv!C4&IF(Inv!D4=0,\"\",Inv!D4)","v":"No cantonal:    "},null,null,null,{"$f":"Inv!C5&IF(Inv!D5=0,\"\",Inv!D6&\" \"&Inv!D5)","v":"Nom:    "}]
[]
[null,{"$f":"Impex!B57","v":""},null,{"$f":"Impex!B58","v":""},null,{"$f":"Impex!B59","v":""},null,{"$f":"Impex!B60","v":""},null," "]
[null,{"$f":"+Inv!F26","v":"MS en %"},{"$f":"IF(Inv!F68=0,\"\",Inv!F68)","v":""},{"$f":"+B5","v":"MS en %"},{"$f":"IF(Inv!F69=0,\"\",Inv!F69)","v":""},{"$f":"+D5","v":"MS en %"},{"$f":"IF(Inv!F70=0,\"\",Inv!F70)","v":""},{"$f":"+F5","v":"MS en %"},{"$f":"IF(Inv!F71=0,\"\",Inv!F71)","v":""}]
[null,{"$f":"+Textes!A116","v":"par kg MS"},null,{"$f":"+B6","v":"par kg MS"},null,{"$f":"+D6","v":"par kg MS"},null,{"$f":"+F6","v":"par kg MS"}]
[null,{"$f":"'BX1'!B9","v":"MJ EDP"},{"$f":"IF(Inv!G68=0,\"\",Inv!G68)","v":""},{"$f":"'BX1'!B9","v":"MJ EDP"},{"$f":"IF(Inv!G69=0,\"\",Inv!G69)","v":""},{"$f":"'BX1'!B9","v":"MJ EDP"},{"$f":"IF(Inv!G70=0,\"\",Inv!G70)","v":""},{"$f":"'BX1'!B9","v":"MJ EDP"},{"$f":"IF(Inv!G71=0,\"\",Inv!G71)","v":""}]
[null,{"$f":"'BX1'!B10","v":"g MA"},{"$f":"IF(Inv!H68=0,\"\",Inv!H68)","v":""},{"$f":"'BX1'!B10","v":"g MA"},{"$f":"IF(Inv!H69=0,\"\",Inv!H69)","v":""},{"$f":"'BX1'!B10","v":"g MA"},{"$f":"IF(Inv!H70=0,\"\",Inv!H70)","v":""},{"$f":"'BX1'!B10","v":"g MA"},{"$f":"IF(Inv!H71=0,\"\",Inv!H71)","v":""}]
[null,{"$f":"'BX1'!B11","v":"g P"},{"$f":"IF(Inv!I68=0,\"\",Inv!I68)","v":""},{"$f":"'BX1'!B11","v":"g P"},{"$f":"IF(Inv!I69=0,\"\",Inv!I69)","v":""},{"$f":"'BX1'!B11","v":"g P"},{"$f":"IF(Inv!I70=0,\"\",Inv!I70)","v":""},{"$f":"'BX1'!B11","v":"g P"},{"$f":"IF(Inv!I71=0,\"\",Inv!I71)","v":""}]
[null,{"$f":"+Textes!A107","v":"Date"},{"$f":"+Textes!A115","v":"kg MF"},{"$f":"+B10","v":"Date"},"kg MF","Date","kg MF","Date","kg MF"]
[null,null,null,null,null,null,null,null,null,null,{"$f":"Textes!A104","v":"Entrée aliments"}]
[]
[]
[]
[]
[]
[]
[]
[]
[]
[]
[]
[]
[]
[]
[]
[]
[]
[]
[]
[]
[]
[]
[]
[]
[]
[]
[]
[]
[]
[]
[]
[]
[]
[]
[]
[]
[]
[]
[]
[]
[]
[]
[]
[]
[]
[]
[null,{"$f":"+Textes!A113","v":"En kg MF"},{"$f":"IF(SUM(C11:C57)=0,0,SUM(C11:C57))","v":0},{"$f":"+B58","v":"En kg MF"},{"$f":"IF(SUM(E11:E57)=0,0,SUM(E11:E57))","v":0},{"$f":"+D58","v":"En kg MF"},{"$f":"IF(SUM(G11:G57)=0,0,SUM(G11:G57))","v":0},{"$f":"+F58","v":"En kg MF"},{"$f":"IF(SUM(I11:I57)=0,0,SUM(I11:I57))","v":0}]
[null,{"$f":"+Textes!A114","v":"En kg MS"},{"$f":"IF(SUM(C11:C57)=0,0,SUM(C11:C57)*C5/100)","v":0},{"$f":"+B59","v":"En kg MS"},{"$f":"IF(SUM(E11:E57)=0,0,(SUM(E11:E57)*E5/100))","v":0},{"$f":"+D59","v":"En kg MS"},{"$f":"IF(SUM(G11:G57)=0,0,SUM(G11:G57)*G5/100)","v":0},{"$f":"+F59","v":"En kg MS"},{"$f":"IF(SUM(I11:I57)=0,0,SUM(I11:I57)*I5/100)","v":0}]
[null,{"$f":"+'BX3'!B60","v":"Tous les aliments utilisés doivent être saisis."}]
[]
[null,{"$f":"+Inv!B84","v":"Organisation de contrôle, Date:"},null,null,null,{"$f":"+Inv!H84","v":"Signature:"}]
[]
[null,{"$f":"+Inv!B86","v":"Exploitant, Date:"},null,null,null,{"$f":"+F62","v":"Signature:"}]

{"sheet":"B6","index":24,"n_rows":64,"n_cols":11,"rows_kept":64,"cut":false,"hidden":false,"merged":[]}
[null,null,null,{"$f":"+'B5'!D1","v":"Impex:   Production porcine"},null,null,null,null,{"$f":"\"B6: \" & K11","v":"B6: Entrée aliments"}]
[null,{"$f":"Inv!C4&IF(Inv!D4=0,\"\",Inv!D4)","v":"No cantonal:    "},null,null,null,{"$f":"Inv!C5&IF(Inv!D5=0,\"\",Inv!D6&\" \"&Inv!D5)","v":"Nom:    "}]
[]
[null,{"$f":"+Inv!B72","v":"Lactosérum"},null,{"$f":"+Inv!B73","v":"CCM"},null,{"$f":"+Inv!B74","v":"Paille, granulés de paille"},null,{"$f":"+Inv!B75","v":"Matériaux d’occupation, dés de fourrage grossier"}]
[null,{"$f":"+Inv!F62","v":"MS en %"},{"$f":"IF(Inv!F72<>\"\",Inv!F72,\"\")","v":6},{"$f":"+B5","v":"MS en %"},{"$f":"IF(Inv!F73<>\"\",Inv!F73,\"\")","v":61},{"$f":"+D5","v":"MS en %"},{"$f":"IF(Inv!F74<>\"\",Inv!F74,\"\")","v":88},{"$f":"+F5","v":"MS en %"},{"$f":"IF(Inv!F75<>\"\",Inv!F75,\"\")","v":87}]
[null,{"$f":"+'B5'!B6","v":"par kg MS"},null,{"$f":"+B6","v":"par kg MS"},null,{"$f":"+D6","v":"par kg MS"},null,{"$f":"+F6","v":"par kg MS"}]
[null,{"$f":"'B1'!B9","v":"MJ EDP"},{"$f":"IF(Inv!G72<>\"\",Inv!G72,\"\")","v":14.6},{"$f":"'B1'!B9","v":"MJ EDP"},{"$f":"IF(Inv!G73<>\"\",Inv!G73,\"\")","v":15.7},{"$f":"'B1'!B9","v":"MJ EDP"},{"$f":"IF(Inv!G74<>\"\",Inv!G74,\"\")","v":2.2000000000000002},{"$f":"'B1'!B9","v":"MJ EDP"},{"$f":"IF(Inv!G75<>\"\",Inv!G75,\"\")","v":2.1}]
[null,{"$f":"'B1'!B10","v":"g MA"},{"$f":"IF(Inv!H72<>\"\",Inv!H72,\"\")","v":129},{"$f":"'B1'!B10","v":"g MA"},{"$f":"IF(Inv!H73<>\"\",Inv!H73,\"\")","v":95},{"$f":"'B1'!B10","v":"g MA"},{"$f":"IF(Inv!H74<>\"\",Inv!H74,\"\")","v":35},{"$f":"'B1'!B10","v":"g MA"},{"$f":"IF(Inv!H75<>\"\",Inv!H75,\"\")","v":25}]
[null,{"$f":"'B1'!B11","v":"g P"},{"$f":"IF(Inv!I72<>\"\",Inv!I72,\"\")","v":7.3},{"$f":"'B1'!B11","v":"g P"},{"$f":"IF(Inv!I73<>\"\",Inv!I73,\"\")","v":3.3},{"$f":"'B1'!B11","v":"g P"},{"$f":"IF(Inv!I74<>\"\",Inv!I74,\"\")","v":0.9},{"$f":"'B1'!B11","v":"g P"},{"$f":"IF(Inv!I75<>\"\",Inv!I75,\"\")","v":1.6}]
[null,{"$f":"+'B5'!B10","v":"Date"},{"$f":"+'B5'!C10","v":"kg MF"},{"$f":"+B10","v":"Date"},{"$f":"+C10","v":"kg MF"},{"$f":"+D10","v":"Date"},{"$f":"+C10","v":"kg MF"},{"$f":"+F10","v":"Date"},{"$f":"+G10","v":"kg MF"}]
[null,null,null,null,null,null,null,null,null,null,{"$f":"Textes!A104","v":"Entrée aliments"}]
[]
[]
[]
[]
[]
[]
[]
[]
[]
[]
[]
[]
[]
[]
[]
[]
[]
[]
[]
[]
[]
[]
[]
[]
[]
[]
[]
[]
[]
[]
[]
[]
[]
[]
[]
[]
[]
[]
[]
[]
[]
[]
[]
[]
[]
[]
[null,{"$f":"+'B5'!B58","v":"En kg MF"},{"$f":"IF(SUM(C11:C57)=0,0,SUM(C11:C57))","v":0},{"$f":"+B58","v":"En kg MF"},{"$f":"IF(SUM(E11:E57)=0,0,SUM(E11:E57))","v":0},{"$f":"D58","v":"En kg MF"},{"$f":"IF(SUM(G11:G57)=0,0,SUM(G11:G57))","v":0},{"$f":"F58","v":"En kg MF"},{"$f":"IF(SUM(I11:I57)=0,0,SUM(I11:I57))","v":0}]
[null,{"$f":"+'B5'!B59","v":"En kg MS"},{"$f":"IF(SUM(C11:C57)=0,0,SUM(C11:C57)*C5/100)","v":0},{"$f":"+B59","v":"En kg MS"},{"$f":"IF(SUM(E11:E57)=0,0,SUM(E11:E57)*E5/100)","v":0},{"$f":"+D59","v":"En kg MS"},{"$f":"IF(SUM(G11:G57)=0,0,SUM(G11:G57)*G5/100)","v":0},{"$f":"+F59","v":"En kg MS"},{"$f":"IF(SUM(I11:I57)=0,0,SUM(I11:I57)*I5/100)","v":0}]
[null,{"$f":"+'B3'!B60","v":"Tous les aliments utilisés doivent être saisis."}]
[]
[null,{"$f":"+Inv!B84","v":"Organisation de contrôle, Date:"},null,null,null,{"$f":"+Inv!H84","v":"Signature:"}]
[]
[null,{"$f":"+Inv!B86","v":"Exploitant, Date:"},null,null,null,{"$f":"+F62","v":"Signature:"}]

{"sheet":"B7","index":25,"n_rows":64,"n_cols":11,"rows_kept":64,"cut":false,"hidden":false,"merged":[]}
[null,null,null,{"$f":"+'B5'!D1","v":"Impex:   Production porcine"},null,null,null,null,{"$f":"\"B7: \" & K11","v":"B7: Entrée aliments"}]
[null,{"$f":"Inv!C4&IF(Inv!D4=0,\"\",Inv!D4)","v":"No cantonal:    "},null,null,null,{"$f":"Inv!C5&IF(Inv!D5=0,\"\",Inv!D6&\" \"&Inv!D5)","v":"Nom:    "}]
[]
[null,{"$f":"+Inv!B77","v":"Maïs, \nplante entière"},null,{"$f":"+Inv!B78","v":"Ensilages de céréales \nplante entière"},null,{"$f":"+Inv!B79","v":"Herbages: \nherbe, silo, …"},null," "]
[null,{"$f":"+Inv!F62","v":"MS en %"},{"$f":"IF(Inv!F77<>\"\",Inv!F77,\"\")","v":100},{"$f":"+B5","v":"MS en %"},{"$f":"IF(Inv!F79<>\"\",Inv!F78,\"\")","v":30},{"$f":"+D5","v":"MS en %"},{"$f":"IF(Inv!F79<>\"\",Inv!F79,\"\")","v":100},{"$f":"+F5","v":"MS en %"}]
[null,{"$f":"+'B5'!B6","v":"par kg MS"},null,{"$f":"+B6","v":"par kg MS"},null,{"$f":"+D6","v":"par kg MS"},null,{"$f":"+F6","v":"par kg MS"}]
[null,{"$f":"'B1'!B9","v":"MJ EDP"},{"$f":"IF(Inv!G77<>\"\",Inv!G77,\"\")","v":10.7},{"$f":"'B1'!B9","v":"MJ EDP"},{"$f":"IF(Inv!G79<>\"\",Inv!G78,\"\")","v":7.4},{"$f":"'B1'!B9","v":"MJ EDP"},{"$f":"IF(Inv!G79<>\"\",Inv!G79,\"\")","v":7.6},{"$f":"'B1'!B9","v":"MJ EDP"}]
[null,{"$f":"'B1'!B10","v":"g MA"},{"$f":"IF(Inv!H77<>\"\",Inv!H77,\"\")","v":75},{"$f":"'B1'!B10","v":"g MA"},{"$f":"IF(Inv!H79<>\"\",Inv!H78,\"\")","v":92},{"$f":"'B1'!B10","v":"g MA"},{"$f":"IF(Inv!H79<>\"\",Inv!H79,\"\")","v":155},{"$f":"'B1'!B10","v":"g MA"}]
[null,{"$f":"'B1'!B11","v":"g P"},{"$f":"IF(Inv!I77<>\"\",Inv!I77,\"\")","v":1.9},{"$f":"'B1'!B11","v":"g P"},{"$f":"IF(Inv!I79<>\"\",Inv!I78,\"\")","v":3.2},{"$f":"'B1'!B11","v":"g P"},{"$f":"IF(Inv!I79<>\"\",Inv!I79,\"\")","v":3.5},{"$f":"'B1'!B11","v":"g P"}]
[null,{"$f":"+'B5'!B10","v":"Date"},{"$f":"+Textes!A118","v":"kg MS"},{"$f":"+B10","v":"Date"},{"$f":"+C10","v":"kg MS"},{"$f":"+D10","v":"Date"},{"$f":"+Textes!A118","v":"kg MS"},{"$f":"+F10","v":"Date"},{"$f":"+G10","v":"kg MS"}]
[null,null,null,null,null,null,null,null,null,null,{"$f":"Textes!A104","v":"Entrée aliments"}]
[]
[]
[]
[]
[]
[]
[]
[]
[]
[]
[]
[]
[]
[]
[]
[]
[]
[]
[]
[]
[]
[]
[]
[]
[]
[]
[]
[]
[]
[]
[]
[]
[]
[]
[]
[]
[]
[]
[]
[]
[]
[]
[]
[]
[]
[]
[null,null,null,{"$f":"+B58","v":0}]
[null,{"$f":"+'B5'!B59","v":"En kg MS"},{"$f":"IF(SUM(C11:C57)=0,0,SUM(C11:C57))","v":0},{"$f":"+B59","v":"En kg MS"},{"$f":"IF(SUM(E11:E57)=0,0,SUM(E11:E57))","v":0},{"$f":"+D59","v":"En kg MS"},{"$f":"IF(SUM(G11:G57)=0,0,SUM(G11:G57))","v":0},{"$f":"+F59","v":"En kg MS"},{"$f":"IF(SUM(I11:I57)=0,0,SUM(I11:I57))","v":0}]
[null,{"$f":"+'B3'!B60","v":"Tous les aliments utilisés doivent être saisis."}]
[]
[null,{"$f":"+Inv!B84","v":"Organisation de contrôle, Date:"},null,null,null,{"$f":"+Inv!H84","v":"Signature:"}]
[]
[null,{"$f":"+Inv!B86","v":"Exploitant, Date:"},null,null,null,{"$f":"+F62","v":"Signature:"}]

{"sheet":"Impex","index":26,"n_rows":95,"n_cols":26,"rows_kept":95,"cut":false,"hidden":false,"merged":[]}
[null,null,null,null,{"$f":"IF(Textes!G2=2,\"Impex:\"&\"   \"&Textes!G4,IF(Textes!G2=3,\"Impex:\"&\"   \"&Textes!G5,IF(Textes!G2=4,\"Impex:\"&\"   \"&Textes!G6,IF(Textes!G2=5,\"Impex:\"&\"   \"&Textes!G7,\"Impex:\"&\"   \"&Textes!G3))))","v":"Impex:   Production porcine"},null,null,null,null,null,null,{"$f":"+Textes!A119","v":"Bilan import/export"}]
[]
[null,null,null,null,null,null,null,null,null,null,null,null,null,null,null,null,null,null,null,"Truten",0.6]
[null,{"$f":"Inv!C4","v":"No cantonal:    "},{"$f":"IF(Inv!D4<>0,Inv!D4,0)","v":0},null,null,null,null,null,{"$f":"Inv!H4","v":"Calculé par:    "},null,{"$f":"IF(Inv!I4<>0,Inv!I4,0)","v":0},null,null,null,null,null,null,null,null,"N",{"$f":"IF(Textes!G2=1,U5,IF(OR(Textes!G2=2,Textes!G2=3,Textes!G2=4),U6,U7))","v":0.8}]
[null,{"$f":"Inv!C5","v":"Nom:    "},{"$f":"IF(Inv!D5=0,\"\",Inv!D6 & \" \" & Inv!D5)","v":""},null,null,null,null,null,{"$f":"Inv!H7","v":"Firme:    "},null,{"$f":"IF(Inv!I7<>0,Inv!I7,0)","v":0},null,null,null,null,null,null,null,null,"Porcs",0.8]
[null,{"$f":"Inv!C7","v":"Adresse:    "},{"$f":"IF(Inv!D7<>0,Inv!D7,0)","v":0},null,null,null,null,null,{"$f":"Inv!H8","v":"Date début:    "},null,{"$f":"IF(H14=0,0,IF(Inv!I8<>0,Inv!I8,P6))","v":"00:00:00"},null,null,null,null,{"$f":"+Textes!A120","v":"Date ?"},null,null,null,"Poulettes",0.6]
[null,{"$f":"Inv!C9","v":"NPA, lieu:    "},{"$f":"IF(Inv!D9<>0,Inv!D9,0)","v":0},null,null,null,null,null,{"$f":"Inv!H9","v":"Date fin:    "},null,{"$f":"IF(H14=0,0,IF(Inv!I9<>0,Inv!I9,P7))","v":"00:00:00"},null,null,null,null,{"$f":"+Textes!A120","v":"Date ?"},null,null,null,"Lapins",0.85]
[]
[null,{"$f":"+Textes!A121","v":"Pas A: Exportation d'éléments fertilisants par les animaux"}]
[]
[null,null,null,{"$f":"+Textes!A122","v":"Inv.-D"},{"$f":"+Textes!A123","v":"Inv.-F"},{"$f":"+Textes!A124","v":"Entrées"},{"$f":"+Textes!A125","v":"Sorties"},{"$f":"+Textes!A126","v":"PV total"},{"$f":"+Textes!A127","v":"g N / kg"},{"$f":"+Textes!A128","v":"g P / kg"},{"$f":"+Textes!A129","v":"Total kg N"},{"$f":"+Textes!A130","v":"Total kg P"},null,null,null,null,null,"Porcs",null,"Poulettes / Poulets engr.",null,"Dindes à l'engrais",null,"Lapins"]
[null,{"$f":"IF(Textes!G2=1,Impex!P12,Impex!Q12)","v":"Animaux < 60 kg PV"},null,{"$f":"IF(Inv!O23=0,0,IF(Textes!G2=1,Inv!O23,Inv!H23))","v":0},{"$f":"IF(Inv!S23=0,0,IF(Textes!G2=1,Inv!S23,Inv!K23))","v":0},{"$f":"IF(ISERROR(SUM(A1a!D6:D60)=TRUE),0,SUM(A1a!D6:D60,A1b!D6:D60,A1c!D6:D60,A1d!D6:D60,A1e!D6:D60))","v":0},{"$f":"IF(ISERROR(SUM(A2a!D8:D60)=TRUE),0,SUM(A2a!D8:D60,A2b!D8:D60,A2c!D8:D60,A2d!D8:D60,A2e!D8:D60))","v":0},{"$f":"-D12+E12-F12+G12","v":0},{"$f":"IF(Textes!G2=1,R12,IF(Textes!G2=4,V12,IF(Textes!G2=5,X12,T12)))","v":25},{"$f":"IF(Textes!G2=1,S12,IF(Textes!G2=4,W12,IF(Textes!G2=5,Y12,U12)))","v":5.3},{"$f":"IF(H12=0,0,H12*I12/1000)","v":0},{"$f":"IF(H12=0,0,H12*J12/1000)","v":0},null,null,null,{"$f":"+Textes!A131","v":"Animaux < 60 kg PV"},{"$f":"+Textes!A133","v":"Animaux"},25,5.3,29.1,5.8,34,5.8,30.4,6.5]
[null,{"$f":"IF(Textes!G2=1,Impex!P13,0)","v":"Animaux > 60 kg PV"},null,{"$f":"IF(Inv!Q23=0,0,IF(Textes!G2=1,Inv!Q23,0))","v":0},{"$f":"IF(Inv!U23=0,0,IF(Textes!G2=1,Inv!U23,0))","v":0},{"$f":"IF(Textes!G2=1,IF(OR(ISERROR(SUM(A1a!G6:G60)=TRUE),ISERROR(SUM(A1b!G6:G60)=TRUE),ISERROR(SUM(A1c!G6:G60)=TRUE),ISERROR(SUM(A1d!G6:G60)=TRUE),ISERROR(SUM(A1e!G6:G60)=TRUE)),0,SUM(A1a!G6:G60,A1b!G6:G60,A1c!G6:G60,A1d!G6:G60,A1e!G6:G60)),0)","v":0},{"$f":"IF(Textes!G2=1,IF(OR(ISERROR(SUM(A2a!J8:J60)=TRUE),ISERROR(SUM(A2b!J8:J60)=TRUE),ISERROR(SUM(A2c!J8:J60)=TRUE),ISERROR(SUM(A2d!J8:J60)=TRUE),ISERROR(SUM(A2e!J8:J60)=TRUE)),0,SUM(A2a!J8:J60,A2b!J8:J60,A2c!J8:J60,A2d!J8:J60,A2e!J8:J60)),0)","v":0},{"$f":"IF(Textes!G2=1,(-D13+E13-F13+G13),0)","v":0},{"$f":"IF(Textes!G2=1,R13,0)","v":26},{"$f":"IF(Textes!G2=1,S13,0)","v":5.4},{"$f":"IF(H13=0,0,IF(Textes!G2=1,(+H13*I13/1000),0))","v":0},{"$f":"IF(H13=0,0,IF(Textes!G2=1,(+H13*J13/1000),0))","v":0},null,null,null,{"$f":"+Textes!A132","v":"Animaux > 60 kg PV"},{"$f":"+Q12","v":"Animaux"},26,5.4]
[null,{"$f":"+Textes!A135","v":"Exportation totale d'éléments fertilisants"},null,null,null,null,null,{"$f":"SUM(H12:H13)","v":0},null,null,{"$f":"SUM(K12:K13)","v":0},{"$f":"SUM(L12:L13)","v":0}]
[]
[null,{"$f":"+Textes!A136","v":"Pas B: Importation d'éléments fertilisants par les aliments"},null,null,null,null,null,null,null,null,{"$f":"+Textes!A196","v":"1g N = 6.25 g MA"}]
[]
[null,null,{"$f":"+Textes!A137","v":"Inv.-D"},{"$f":"+Textes!A138","v":"Inv.-F"},{"$f":"+Textes!A139","v":"Entrées"},{"$f":"+Textes!A140","v":"kg total"},{"$f":"+Textes!A141","v":"% MS"},{"$f":"+Inv!G26","v":"MJ EDP"},{"$f":"+Textes!A143","v":"g MA / kg"},{"$f":"+Textes!A144","v":"g P / kg"},{"$f":"+Textes!A145","v":"Total kg N"},{"$f":"+Textes!A146","v":"Total kg P"},null,null,"Tot RP","N / kg in g","Tot VES","kg Futter"]
[null,null,{"$f":"+Textes!A147","v":"en kg aliment"},null,null,null,null,{"$f":"+Textes!A148","v":"par kg aliment"}]
[null,{"$f":"IF(AND(Inv!B28=0,Inv!C28=0),\"\",Inv!B28 & \" \" & Inv!C28)","v":""},{"$f":"Inv!J28","v":0},{"$f":"Inv!K28","v":0},{"$f":"IF(ISERROR(SUM('B1'!C13:C57)=TRUE),0,SUM('B1'!C13:C57))","v":0},{"$f":"E20+C20-D20","v":0},{"$f":"Inv!F28","v":0},{"$f":"Inv!G28","v":0},{"$f":"Inv!H28","v":0},{"$f":"Inv!I28","v":0},{"$f":"F20*I20/6.25/1000","v":0},{"$f":"F20*J20/1000","v":0},null,null,{"$f":"I20*F20","v":0},{"$f":"I20/6.25","v":0},{"$f":"+F20*H20","v":0},{"$f":"+F20*G20/88","v":0}]
[null,{"$f":"IF(AND(Inv!B29=0,Inv!C29=0),\"\",Inv!B29 & \" \" & Inv!C29)","v":""},{"$f":"Inv!J29","v":0},{"$f":"Inv!K29","v":0},{"$f":"IF(ISERROR(SUM('B1'!E13:E57)=TRUE),0,SUM('B1'!E13:E57))","v":0},{"$f":"E21+C21-D21","v":0},{"$f":"Inv!F29","v":0},{"$f":"Inv!G29","v":0},{"$f":"Inv!H29","v":0},{"$f":"Inv!I29","v":0},0,0,null,null,{"$f":"I21*F21","v":0},0,0,{"$f":"+F21*G21/88","v":0}]
[null,{"$f":"IF(AND(Inv!B30=0,Inv!C30=0),\"\",Inv!B30 & \" \" & Inv!C30)","v":""},{"$f":"Inv!J30","v":0},{"$f":"Inv!K30","v":0},{"$f":"IF(ISERROR(SUM('B1'!G13:G57)=TRUE),0,SUM('B1'!G13:G57))","v":0},{"$f":"E22+C22-D22","v":0},{"$f":"Inv!F30","v":0},{"$f":"Inv!G30","v":0},{"$f":"Inv!H30","v":0},{"$f":"Inv!I30","v":0},0,0,null,null,0,0,0,0]
[null,{"$f":"IF(AND(Inv!B31=0,Inv!C31=0),\"\",Inv!B31 & \" \" & Inv!C31)","v":""},{"$f":"Inv!J31","v":0},{"$f":"Inv!K31","v":0},{"$f":"IF(ISERROR(SUM('B1'!I13:I57)=TRUE),0,SUM('B1'!I13:I57))","v":0},0,{"$f":"Inv!F31","v":0},{"$f":"Inv!G31","v":0},{"$f":"Inv!H31","v":0},{"$f":"Inv!I31","v":0},0,0,null,null,0,0,0,0]
[null,{"$f":"IF(AND(Inv!B32=0,Inv!C32=0),\"\",Inv!B32 & \" \" & Inv!C32)","v":""},{"$f":"Inv!J32","v":0},{"$f":"Inv!K32","v":0},{"$f":"IF(ISERROR(SUM('B2'!C13:C57)=TRUE),0,SUM('B2'!C13:C57))","v":0},0,{"$f":"Inv!F32","v":0},{"$f":"Inv!G32","v":0},{"$f":"Inv!H32","v":0},{"$f":"Inv!I32","v":0},0,0,null,null,0,0,0,0]
[null,{"$f":"IF(AND(Inv!B33=0,Inv!C33=0),\"\",Inv!B33 & \" \" & Inv!C33)","v":""},{"$f":"Inv!J33","v":0},{"$f":"Inv!K33","v":0},{"$f":"IF(ISERROR(SUM('B2'!E13:E57)=TRUE),0,SUM('B2'!E13:E57))","v":0},0,{"$f":"Inv!F33","v":0},{"$f":"Inv!G33","v":0},{"$f":"Inv!H33","v":0},{"$f":"Inv!I33","v":0},0,0,null,null,0,0,0,0]
[null,{"$f":"IF(AND(Inv!B34=0,Inv!C34=0),\"\",Inv!B34 & \" \" & Inv!C34)","v":""},{"$f":"Inv!J34","v":0},{"$f":"Inv!K34","v":0},{"$f":"IF(ISERROR(SUM('B2'!G13:G57)=TRUE),0,SUM('B2'!G13:G57))","v":0},0,{"$f":"Inv!F34","v":0},{"$f":"Inv!G34","v":0},{"$f":"Inv!H34","v":0},{"$f":"Inv!I34","v":0},0,0,null,null,0,0,0,0]
[null,{"$f":"IF(AND(Inv!B35=0,Inv!C35=0),\"\",Inv!B35 & \" \" & Inv!C35)","v":""},{"$f":"Inv!J35","v":0},{"$f":"Inv!K35","v":0},{"$f":"IF(ISERROR(SUM('B2'!I13:I57)=TRUE),0,SUM('B2'!I13:I57))","v":0},0,{"$f":"Inv!F35","v":0},{"$f":"Inv!G35","v":0},{"$f":"Inv!H35","v":0},{"$f":"Inv!I35","v":0},0,0,null,null,0,0,0,0]
[null,{"$f":"IF(AND(Inv!B36=0,Inv!C36=0),\"\",Inv!B36 & \" \" & Inv!C36)","v":""},{"$f":"Inv!J36","v":0},{"$f":"Inv!K36","v":0},{"$f":"IF(ISERROR(SUM('B3'!C13:C57)=TRUE),0,SUM('B3'!C13:C57))","v":0},0,{"$f":"Inv!F36","v":0},{"$f":"Inv!G36","v":0},{"$f":"Inv!H36","v":0},{"$f":"Inv!I36","v":0},0,0,null,null,0,0,0,0]
[null,{"$f":"IF(AND(Inv!B37=0,Inv!C37=0),\"\",Inv!B37 & \" \" & Inv!C37)","v":""},{"$f":"Inv!J37","v":0},{"$f":"Inv!K37","v":0},{"$f":"IF(ISERROR(SUM('B3'!E13:E57)=TRUE),0,SUM('B3'!E13:E57))","v":0},0,{"$f":"Inv!F37","v":0},{"$f":"Inv!G37","v":0},{"$f":"Inv!H37","v":0},{"$f":"Inv!I37","v":0},0,0,null,null,0,0,0,0]
[null,{"$f":"IF(AND(Inv!B38=0,Inv!C38=0),\"\",Inv!B38 & \" \" & Inv!C38)","v":""},{"$f":"Inv!J38","v":0},{"$f":"Inv!K38","v":0},{"$f":"IF(ISERROR(SUM('B3'!G13:G57)=TRUE),0,SUM('B3'!G13:G57))","v":0},0,{"$f":"Inv!F38","v":0},{"$f":"Inv!G38","v":0},{"$f":"Inv!H38","v":0},{"$f":"Inv!I38","v":0},0,0,null,null,0,0,0,0]
[null,{"$f":"IF(AND(Inv!B39=0,Inv!C39=0),\"\",Inv!B39 & \" \" & Inv!C39)","v":""},{"$f":"Inv!J39","v":0},{"$f":"Inv!K39","v":0},{"$f":"IF(ISERROR(SUM('B3'!I13:I57)=TRUE),0,SUM('B3'!I13:I57))","v":0},0,{"$f":"Inv!F39","v":0},{"$f":"Inv!G39","v":0},{"$f":"Inv!H39","v":0},{"$f":"Inv!I39","v":0},{"$f":"F31*I31/6.25/1000","v":0},{"$f":"F31*J31/1000","v":0},null,null,0,0,{"$f":"+F31*H31","v":0},{"$f":"+F31*G31/88","v":0}]
[null,{"$f":"IF(AND(Inv!B40=0,Inv!C40=0),\"\",Inv!B40 & \" \" & Inv!C40)","v":""},{"$f":"Inv!J40","v":0},{"$f":"Inv!K40","v":0},{"$f":"IF(ISERROR(SUM('B4'!C13:C57)=TRUE),0,SUM('B4'!C13:C57))","v":0},0,{"$f":"Inv!F40","v":0},{"$f":"Inv!G40","v":0},{"$f":"Inv!H40","v":0},{"$f":"Inv!I40","v":0},{"$f":"F32*I32/6.25/1000","v":0},{"$f":"F32*J32/1000","v":0},null,null,0,0,{"$f":"+F32*H32","v":0},{"$f":"+F32*G32/88","v":0}]
[null,{"$f":"IF(AND(Inv!B41=0,Inv!C41=0),\"\",Inv!B41 & \" \" & Inv!C41)","v":""},{"$f":"Inv!J41","v":0},{"$f":"Inv!K41","v":0},{"$f":"IF(ISERROR(SUM('B4'!E13:E57)=TRUE),0,SUM('B4'!E13:E57))","v":0},0,{"$f":"Inv!F41","v":0},{"$f":"Inv!G41","v":0},{"$f":"Inv!H41","v":0},{"$f":"Inv!I41","v":0},{"$f":"F33*I33/6.25/1000","v":0},{"$f":"F33*J33/1000","v":0},null,null,0,0,{"$f":"+F33*H33","v":0},{"$f":"+F33*G33/88","v":0}]
[null,{"$f":"IF(AND(Inv!B42=0,Inv!C42=0),\"\",Inv!B42 & \" \" & Inv!C42)","v":""},{"$f":"Inv!J42","v":0},{"$f":"Inv!K42","v":0},{"$f":"IF(ISERROR(SUM('B4'!G13:G57)=TRUE),0,SUM('B4'!G13:G57))","v":0},0,{"$f":"Inv!F42","v":0},{"$f":"Inv!G42","v":0},{"$f":"Inv!H42","v":0},{"$f":"Inv!I42","v":0},{"$f":"F34*I34/6.25/1000","v":0},{"$f":"F34*J34/1000","v":0},null,null,0,0,{"$f":"+F34*H34","v":0},{"$f":"+F34*G34/88","v":0}]
[null,{"$f":"IF(AND(Inv!B43=0,Inv!C43=0),\"\",Inv!B43 & \" \" & Inv!C43)","v":""},{"$f":"Inv!J43","v":0},{"$f":"Inv!K43","v":0},{"$f":"IF(ISERROR(SUM('B4'!I13:I57)=TRUE),0,SUM('B4'!I13:I57))","v":0},0,{"$f":"Inv!F43","v":0},{"$f":"Inv!G43","v":0},{"$f":"Inv!H43","v":0},{"$f":"Inv!I43","v":0},0,0,null,null,0,0,0,0]
[null,{"$f":"IF(AND(Inv!B44=0,Inv!C44=0),\"\",Inv!B44 & \" \" & Inv!C44)","v":""},{"$f":"Inv!J44","v":0},{"$f":"Inv!K44","v":0},{"$f":"IF(ISERROR(SUM('BX1'!C13:C57)=TRUE),0,SUM('BX1'!C13:C57))","v":0},{"$f":"E36+C36-D36","v":0},{"$f":"Inv!F44","v":0},{"$f":"Inv!G44","v":0},{"$f":"Inv!H44","v":0},{"$f":"Inv!I44","v":0},{"$f":"F36*I36/6.25/1000","v":0},{"$f":"F36*J36/1000","v":0},null,null,0,{"$f":"I36/6.25","v":0},{"$f":"+F36*H36","v":0},{"$f":"+F36*G36/88","v":0}]
[null,{"$f":"IF(AND(Inv!B45=0,Inv!C45=0),\"\",Inv!B45 & \" \" & Inv!C45)","v":""},{"$f":"Inv!J45","v":0},{"$f":"Inv!K45","v":0},{"$f":"IF(ISERROR(SUM('BX1'!E13:E57)=TRUE),0,SUM('BX1'!E13:E57))","v":0},{"$f":"E37+C37-D37","v":0},{"$f":"Inv!F45","v":0},{"$f":"Inv!G45","v":0},{"$f":"Inv!H45","v":0},{"$f":"Inv!I45","v":0},0,0,null,null,0,0,0,{"$f":"+F37*G37/88","v":0}]
[null,{"$f":"IF(AND(Inv!B46=0,Inv!C46=0),\"\",Inv!B46 & \" \" & Inv!C46)","v":""},{"$f":"Inv!J46","v":0},{"$f":"Inv!K46","v":0},{"$f":"IF(ISERROR(SUM('BX1'!G13:G57)=TRUE),0,SUM('BX1'!G13:G57))","v":0},{"$f":"E38+C38-D38","v":0},{"$f":"Inv!F46","v":0},{"$f":"Inv!G46","v":0},{"$f":"Inv!H46","v":0},{"$f":"Inv!I46","v":0},0,0,null,null,0,0,0,0]
[null,{"$f":"IF(AND(Inv!B47=0,Inv!C47=0),\"\",Inv!B47 & \" \" & Inv!C47)","v":""},{"$f":"Inv!J47","v":0},{"$f":"Inv!K47","v":0},{"$f":"IF(ISERROR(SUM('BX1'!I13:I57)=TRUE),0,SUM('BX1'!I13:I57))","v":0},0,{"$f":"Inv!F47","v":0},{"$f":"Inv!G47","v":0},{"$f":"Inv!H47","v":0},{"$f":"Inv!I47","v":0},0,0,null,null,0,0,0,0]
[null,{"$f":"IF(AND(Inv!B48=0,Inv!C48=0),\"\",Inv!B48 & \" \" & Inv!C48)","v":""},{"$f":"Inv!J48","v":0},{"$f":"Inv!K48","v":0},{"$f":"IF(ISERROR(SUM('BX2'!C13:C57)=TRUE),0,SUM('BX2'!C13:C57))","v":0},0,{"$f":"Inv!F48","v":0},{"$f":"Inv!G48","v":0},{"$f":"Inv!H48","v":0},{"$f":"Inv!I48","v":0},0,0,null,null,0,0,0,0]
[null,{"$f":"IF(AND(Inv!B49=0,Inv!C49=0),\"\",Inv!B49 & \" \" & Inv!C49)","v":""},{"$f":"Inv!J49","v":0},{"$f":"Inv!K49","v":0},{"$f":"IF(ISERROR(SUM('BX2'!E13:E57)=TRUE),0,SUM('BX2'!E13:E57))","v":0},0,{"$f":"Inv!F49","v":0},{"$f":"Inv!G49","v":0},{"$f":"Inv!H49","v":0},{"$f":"Inv!I49","v":0},0,0,null,null,0,0,0,0]
[null,{"$f":"IF(AND(Inv!B50=0,Inv!C50=0),\"\",Inv!B50 & \" \" & Inv!C50)","v":""},{"$f":"Inv!J50","v":0},{"$f":"Inv!K50","v":0},{"$f":"IF(ISERROR(SUM('BX2'!G13:G57)=TRUE),0,SUM('BX2'!G13:G57))","v":0},0,{"$f":"Inv!F50","v":0},{"$f":"Inv!G50","v":0},{"$f":"Inv!H50","v":0},{"$f":"Inv!I50","v":0},0,0,null,null,0,0,0,0]
[null,{"$f":"IF(AND(Inv!B51=0,Inv!C51=0),\"\",Inv!B51 & \" \" & Inv!C51)","v":""},{"$f":"Inv!J51","v":0},{"$f":"Inv!K51","v":0},{"$f":"IF(ISERROR(SUM('BX2'!I13:I57)=TRUE),0,SUM('BX2'!I13:I57))","v":0},0,{"$f":"Inv!F51","v":0},{"$f":"Inv!G51","v":0},{"$f":"Inv!H51","v":0},{"$f":"Inv!I51","v":0},0,0,null,null,0,0,0,0]
[null,{"$f":"IF(AND(Inv!B52=0,Inv!C52=0),\"\",Inv!B52 & \" \" & Inv!C52)","v":""},{"$f":"Inv!J52","v":0},{"$f":"Inv!K52","v":0},{"$f":"IF(ISERROR(SUM('BX3'!C13:C57)=TRUE),0,SUM('BX3'!C13:C57))","v":0},0,{"$f":"Inv!F52","v":0},{"$f":"Inv!G52","v":0},{"$f":"Inv!H52","v":0},{"$f":"Inv!I52","v":0},0,0,null,null,0,0,0,0]
[null,{"$f":"IF(AND(Inv!B53=0,Inv!C53=0),\"\",Inv!B53 & \" \" & Inv!C53)","v":""},{"$f":"Inv!J53","v":0},{"$f":"Inv!K53","v":0},{"$f":"IF(ISERROR(SUM('BX3'!E13:E57)=TRUE),0,SUM('BX3'!E13:E57))","v":0},0,{"$f":"Inv!F53","v":0},{"$f":"Inv!G53","v":0},{"$f":"Inv!H53","v":0},{"$f":"Inv!I53","v":0},0,0,null,null,0,0,0,0]
[null,{"$f":"IF(AND(Inv!B54=0,Inv!C54=0),\"\",Inv!B54 & \" \" & Inv!C54)","v":""},{"$f":"Inv!J54","v":0},{"$f":"Inv!K54","v":0},{"$f":"IF(ISERROR(SUM('BX3'!G13:G57)=TRUE),0,SUM('BX3'!G13:G57))","v":0},0,{"$f":"Inv!F54","v":0},{"$f":"Inv!G54","v":0},{"$f":"Inv!H54","v":0},{"$f":"Inv!I54","v":0},0,0,null,null,0,0,0,0]
[null,{"$f":"IF(AND(Inv!B55=0,Inv!C55=0),\"\",Inv!B55 & \" \" & Inv!C55)","v":""},{"$f":"Inv!J55","v":0},{"$f":"Inv!K55","v":0},{"$f":"IF(ISERROR(SUM('BX3'!I13:I57)=TRUE),0,SUM('BX3'!I13:I57))","v":0},0,{"$f":"Inv!F55","v":0},{"$f":"Inv!G55","v":0},{"$f":"Inv!H55","v":0},{"$f":"Inv!I55","v":0},{"$f":"F47*I47/6.25/1000","v":0},{"$f":"F47*J47/1000","v":0},null,null,0,0,{"$f":"+F47*H47","v":0},{"$f":"+F47*G47/88","v":0}]
[null,{"$f":"IF(AND(Inv!B56=0,Inv!C56=0),\"\",Inv!B56 & \" \" & Inv!C56)","v":""},{"$f":"Inv!J56","v":0},{"$f":"Inv!K56","v":0},{"$f":"IF(ISERROR(SUM('BX4'!C13:C57)=TRUE),0,SUM('BX4'!C13:C57))","v":0},0,{"$f":"Inv!F56","v":0},{"$f":"Inv!G56","v":0},{"$f":"Inv!H56","v":0},{"$f":"Inv!I56","v":0},{"$f":"F48*I48/6.25/1000","v":0},{"$f":"F48*J48/1000","v":0},null,null,0,0,{"$f":"+F48*H48","v":0},{"$f":"+F48*G48/88","v":0}]
[null,{"$f":"IF(AND(Inv!B57=0,Inv!C57=0),\"\",Inv!B57 & \" \" & Inv!C57)","v":""},{"$f":"Inv!J57","v":0},{"$f":"Inv!K57","v":0},{"$f":"IF(ISERROR(SUM('BX4'!E13:E57)=TRUE),0,SUM('BX4'!E13:E57))","v":0},0,{"$f":"Inv!F57","v":0},{"$f":"Inv!G57","v":0},{"$f":"Inv!H57","v":0},{"$f":"Inv!I57","v":0},{"$f":"F49*I49/6.25/1000","v":0},{"$f":"F49*J49/1000","v":0},null,null,0,0,{"$f":"+F49*H49","v":0},{"$f":"+F49*G49/88","v":0}]
[null,{"$f":"IF(AND(Inv!B58=0,Inv!C58=0),\"\",Inv!B58 & \" \" & Inv!C58)","v":""},{"$f":"Inv!J58","v":0},{"$f":"Inv!K58","v":0},{"$f":"IF(ISERROR(SUM('BX4'!G13:G57)=TRUE),0,SUM('BX4'!G13:G57))","v":0},0,{"$f":"Inv!F58","v":0},{"$f":"Inv!G58","v":0},{"$f":"Inv!H58","v":0},{"$f":"Inv!I58","v":0},{"$f":"F50*I50/6.25/1000","v":0},{"$f":"F50*J50/1000","v":0},null,null,0,0,{"$f":"+F50*H50","v":0},{"$f":"+F50*G50/88","v":0}]
[null,{"$f":"IF(AND(Inv!B59=0,Inv!C59=0),\"\",Inv!B59 & \" \" & Inv!C59)","v":""},{"$f":"Inv!J59","v":0},{"$f":"Inv!K59","v":0},{"$f":"IF(ISERROR(SUM('BX4'!I13:I57)=TRUE),0,SUM('BX4'!I13:I57))","v":0},0,{"$f":"Inv!F59","v":0},{"$f":"Inv!G59","v":0},{"$f":"Inv!H59","v":0},{"$f":"Inv!I59","v":0},{"$f":"F51*I51/6.25/1000","v":0},{"$f":"F51*J51/1000","v":0},null,null,0,0,{"$f":"+F51*H51","v":0},{"$f":"+F51*G51/88","v":0}]
[null,null,{"$f":"+Textes!A149","v":"en kg MS"},null,null,null,{"$f":"+G18","v":"% MS"},{"$f":"+Textes!A150","v":"par kg MS"}]
[null,{"$f":"IF(AND(Inv!B64=0,Inv!C64=0),\"\",Inv!B64 & \" \" & Inv!C64)","v":""},{"$f":"IF(Inv!J64=0,0,Inv!J64*'B5'!C5/100)","v":0},{"$f":"IF(Inv!K64=0,0,Inv!K64*'B5'!C5/100)","v":0},{"$f":"IF(SUM('B5'!C11:C57)=0,0,SUM('B5'!C11:C57)*'B5'!C5/100)","v":0},{"$f":"E53+C53-D53","v":0},{"$f":"Inv!F64","v":0},{"$f":"Inv!G64","v":0},{"$f":"Inv!H64","v":0},{"$f":"Inv!I64","v":0},{"$f":"F53*I53/6.25/1000","v":0},{"$f":"F53*J53/1000","v":0},null,null,0,0,{"$f":"+F53*H53","v":0},{"$f":"+F53/0.88","v":0}]
[null,{"$f":"IF(AND(Inv!B65=0,Inv!C65=0),\"\",Inv!B65 & \" \" & Inv!C65)","v":""},{"$f":"IF(Inv!J65=0,0,Inv!J65*'B5'!E5/100)","v":0},{"$f":"IF(Inv!K65=0,0,Inv!K65*'B5'!E5/100)","v":0},{"$f":"IF(SUM('B5'!E11:E57)=0,0,SUM('B5'!E11:E57)*'B5'!E5/100)","v":0},0,{"$f":"Inv!F65","v":0},{"$f":"Inv!G65","v":0},{"$f":"Inv!H65","v":0},{"$f":"Inv!I65","v":0},0,0,null,null,0,0,0,0]
[null,{"$f":"IF(AND(Inv!B66=0,Inv!C66=0),\"\",Inv!B66 & \" \" & Inv!C66)","v":""},{"$f":"IF(Inv!J66=0,0,Inv!J66*'B5'!G5/100)","v":0},{"$f":"IF(Inv!K66=0,0,Inv!K66*'B5'!G5/100)","v":0},{"$f":"IF(SUM('B5'!G11:G57)=0,0,SUM('B5'!G11:G57)*'B5'!G5/100)","v":0},0,{"$f":"Inv!F66","v":0},{"$f":"Inv!G66","v":0},{"$f":"Inv!H66","v":0},{"$f":"Inv!I66","v":0},0,0,null,null,0,0,0,0]
[null,{"$f":"IF(AND(Inv!B67=0,Inv!C67=0),\"\",Inv!B67 & \" \" & Inv!C67)","v":""},{"$f":"IF(Inv!J67=0,0,Inv!J67*'B5'!I5/100)","v":0},{"$f":"IF(Inv!K67=0,0,Inv!K67*'B5'!I5/100)","v":0},{"$f":"IF(SUM('B5'!I11:I57)=0,0,SUM('B5'!I11:I57)*'B5'!I5/100)","v":0},0,{"$f":"Inv!F67","v":0},{"$f":"Inv!G67","v":0},{"$f":"Inv!H67","v":0},{"$f":"Inv!I67","v":0},0,0,null,null,0,0,0,0]
[null,{"$f":"IF(AND(Inv!B68=0,Inv!C68=0),\"\",Inv!B68 & \" \" & Inv!C68)","v":""},{"$f":"IF(Inv!J68=0,0,Inv!J68*'BX5'!C5/100)","v":0},{"$f":"IF(Inv!K68=0,0,Inv!K68*'BX5'!C5/100)","v":0},{"$f":"IF(SUM('BX5'!C11:C57)=0,0,SUM('BX5'!C11:C57)*'BX5'!C5/100)","v":0},{"$f":"E57+C57-D57","v":0},{"$f":"Inv!F68","v":0},{"$f":"Inv!G68","v":0},{"$f":"Inv!H68","v":0},{"$f":"Inv!I68","v":0},{"$f":"F57*I57/6.25/1000","v":0},{"$f":"F57*J57/1000","v":0},null,null,0,{"$f":"I57/6.25","v":0},{"$f":"+F57*H57","v":0},{"$f":"+F57/0.88","v":0}]
[null,{"$f":"IF(AND(Inv!B69=0,Inv!C69=0),\"\",Inv!B69 & \" \" & Inv!C69)","v":""},{"$f":"IF(Inv!J69=0,0,Inv!J69*'BX5'!E5/100)","v":0},{"$f":"IF(Inv!K69=0,0,Inv!K69*'BX5'!E5/100)","v":0},{"$f":"IF(SUM('BX5'!E11:E57)=0,0,SUM('BX5'!E11:E57)*'BX5'!E5/100)","v":0},{"$f":"E58+C58-D58","v":0},{"$f":"Inv!F69","v":0},{"$f":"Inv!G69","v":0},{"$f":"Inv!H69","v":0},{"$f":"Inv!I69","v":0},{"$f":"F58*I58/6.25/1000","v":0},{"$f":"F58*J58/1000","v":0},null,null,0,{"$f":"I58/6.25","v":0},{"$f":"+F58*H58","v":0},{"$f":"+F58/0.88","v":0}]
[null,{"$f":"IF(AND(Inv!B70=0,Inv!C70=0),\"\",Inv!B70 & \" \" & Inv!C70)","v":""},{"$f":"IF(Inv!J70=0,0,Inv!J70*'BX5'!G5/100)","v":0},{"$f":"IF(Inv!K70=0,0,Inv!K70*'BX5'!G5/100)","v":0},{"$f":"IF(SUM('BX5'!G11:G57)=0,0,SUM('BX5'!G11:G57)*'BX5'!G5/100)","v":0},{"$f":"E59+C59-D59","v":0},{"$f":"Inv!F70","v":0},{"$f":"Inv!G70","v":0},{"$f":"Inv!H70","v":0},{"$f":"Inv!I70","v":0},{"$f":"F59*I59/6.25/1000","v":0},{"$f":"F59*J59/1000","v":0},null,null,0,{"$f":"I59/6.25","v":0},{"$f":"+F59*H59","v":0},{"$f":"+F59/0.88","v":0}]
[null,{"$f":"IF(AND(Inv!B71=0,Inv!C71=0),\"\",Inv!B71 & \" \" & Inv!C71)","v":""},{"$f":"IF(Inv!J71=0,0,Inv!J71*'BX5'!I5/100)","v":0},{"$f":"IF(Inv!K71=0,0,Inv!K71*'BX5'!I5/100)","v":0},{"$f":"IF(SUM('BX5'!I11:I57)=0,0,SUM('BX5'!I11:I57)*'BX5'!I5/100)","v":0},{"$f":"E60+C60-D60","v":0},{"$f":"Inv!F71","v":0},{"$f":"Inv!G71","v":0},{"$f":"Inv!H71","v":0},{"$f":"Inv!I71","v":0},{"$f":"F60*I60/6.25/1000","v":0},{"$f":"F60*J60/1000","v":0},null,null,0,{"$f":"I60/6.25","v":0},{"$f":"+F60*H60","v":0},{"$f":"+F60/0.88","v":0}]
[null,{"$f":"Inv!B72","v":"Lactosérum"},{"$f":"IF(Inv!J72=0,0,Inv!J72*'B6'!C5/100)","v":0},{"$f":"IF(Inv!K72=0,0,Inv!K72*'B6'!C5/100)","v":0},{"$f":"IF(SUM('B6'!C11:C57)=0,0,SUM('B6'!C11:C57)*'B6'!C5/100)","v":0},0,{"$f":"Inv!F72","v":6},{"$f":"Inv!G72","v":14.6},{"$f":"Inv!H72","v":129},{"$f":"Inv!I72","v":7.3},0,0,null,null,0,20.64,{"$f":"F61*H61","v":0},0]
[null,{"$f":"Inv!B73","v":"CCM"},{"$f":"IF(Inv!J73=0,0,Inv!J73*'B6'!E5/100)","v":0},{"$f":"IF(Inv!K73=0,0,Inv!K73*'B6'!E5/100)","v":0},{"$f":"IF(SUM('B6'!E11:E57)=0,0,SUM('B6'!E11:E57)*'B6'!E5/100)","v":0},0,{"$f":"Inv!F73","v":61},{"$f":"Inv!G73","v":15.7},{"$f":"Inv!H73","v":95},{"$f":"Inv!I73","v":3.3},0,0,null,null,0,15.2,{"$f":"F62*H62","v":0},0]
[null,{"$f":"+Inv!B74","v":"Paille, granulés de paille"},{"$f":"IF(Inv!J74=0,0,Inv!J74*'B6'!G5/100)","v":0},{"$f":"IF(Inv!K74=0,0,Inv!K74*'B6'!G5/100)","v":0},{"$f":"IF(SUM('B6'!G11:G57)=0,0,SUM('B6'!G11:G57)*'B6'!G5/100)","v":0},0,{"$f":"Inv!F74","v":88},{"$f":"Inv!G74","v":2.2000000000000002},{"$f":"Inv!H74","v":35},{"$f":"Inv!I74","v":0.9},0,0,null,null,null,5.6]
[null,{"$f":"+Inv!B75","v":"Matériaux d’occupation, dés de fourrage grossier"},{"$f":"IF(Inv!J75=0,0,Inv!J75*'B6'!I5/100)","v":0},{"$f":"IF(Inv!K75=0,0,Inv!K75*'B6'!I5/100)","v":0},{"$f":"IF(SUM('B6'!I11:I57)=0,0,SUM('B6'!I11:I57)*'B6'!I5/100)","v":0},0,{"$f":"Inv!F75","v":87},{"$f":"Inv!G75","v":2.1},{"$f":"Inv!H75","v":25},{"$f":"Inv!I75","v":1.6},0,0,null,null,null,4]
[null,{"$f":"+Inv!B77","v":"Maïs, \nplante entière"},{"$f":"Inv!J77","v":0},{"$f":"Inv!K77","v":0},{"$f":"IF(SUM('B7'!C11:C57)=0,0,SUM('B7'!C11:C57))","v":0},0,{"$f":"Inv!F77","v":100},{"$f":"Inv!G77","v":10.7},{"$f":"Inv!H77","v":75},{"$f":"Inv!I77","v":1.9},0,0,null,null,0,12,{"$f":"F65*H65","v":0},{"$f":"F65/0.88","v":0}]
[null,{"$f":"+Textes!A151","v":"Ensil. de céréal. \npl. entière"},{"$f":"Inv!J78","v":0},{"$f":"Inv!K78","v":0},{"$f":"IF(SUM('B7'!E12:E58)=0,0,SUM('B7'!E12:E58))","v":0},{"$f":"E66+C66-D66","v":0},{"$f":"Inv!F78","v":30},{"$f":"Inv!G78","v":7.4},{"$f":"Inv!H78","v":92},{"$f":"Inv!I78","v":3.2},{"$f":"F66*I66/6.25/1000","v":0},{"$f":"F66*J66/1000","v":0},null,null,{"$f":"I66*F66","v":0},{"$f":"I66/6.25","v":14.72},{"$f":"F66*H66","v":0},{"$f":"F66/0.88","v":0}]
[null,{"$f":"+Textes!A152","v":"Herbages: \nherbe, silo, …"},{"$f":"Inv!J79","v":0},{"$f":"Inv!K79","v":0},{"$f":"IF(SUM('B7'!G11:G57)=0,0,SUM('B7'!G11:G57))","v":0},0,{"$f":"Inv!F79","v":100},{"$f":"Inv!G79","v":7.6},{"$f":"Inv!H79","v":155},{"$f":"Inv!I79","v":3.5},0,0,null,null,0,24.8,{"$f":"F67*H67","v":0},{"$f":"F67/0.88","v":0}]
[null,{"$f":"+Textes!A153","v":"Importation totale d'éléments fertilisants"},null,null,null,null,null,null,null,null,{"$f":"SUM(K20:K67)","v":0},{"$f":"SUM(L20:L67)","v":0},null,"Total",{"$f":"SUM(O20:O67)","v":0},{"$f":"SUM(P20:P67)","v":96.960000000000008},{"$f":"SUM(Q20:Q67)","v":0},{"$f":"SUM(R20:R67)","v":0},{"$f":"IF(Q68>0,O68/Q68,0)","v":0},{"$f":"Textes!A174","v":"y. c. fourrages"}]
[null,null,null,null,null,null,null,null,null,null,null,null,null,null,{"$f":"SUM(O20:O62)","v":0},{"$f":"SUM(P20:P62)","v":35.840000000000003},{"$f":"SUM(Q20:Q62)","v":0},0,{"$f":"IF(Q69>0,O69/Q69,0)","v":0},{"$f":"Textes!A175","v":"sans fourrages"}]
[null,{"$f":"+Textes!A154","v":"Pas C: Bilan import/export"}]
[]
[null,null,null,null,{"$f":"+Textes!A155","v":"kg N"},{"$f":"+Textes!A156","v":"kg P"},{"$f":"+Textes!A157","v":"kg Nstock"},{"$f":"+Textes!A158","v":"kg P2O5"}]
[null,{"$f":"+Textes!A159","v":"Exportation par les animaux"},null,null,{"$f":"IF(K14=0,0,K14*-1)","v":0},{"$f":"IF(L14=0,0,L14*-1)","v":0},{"$f":"E73*U4","v":0},{"$f":"F73*2.291","v":0},null,"1 kg N",{"$f":"\"= \"&U4&\" \"&Textes!A163","v":"= 0.8 kg Nstock"}]
[null,{"$f":"+Textes!A160","v":"Importation par les aliments"},null,null,{"$f":"+K68","v":0},{"$f":"+L68","v":0},{"$f":"+E74*U4","v":0},{"$f":"+F74*2.291","v":0},null,"1 kg P","= 2.291 kg P2O5"]
[null,{"$f":"+Textes!A161","v":"Pour la période"},{"$f":"IF(OR(K6=P6,K7=P7,K6=0,K7=0),0,K7-K6+1)","v":0},{"$f":"+Textes!A197","v":"jours"},{"$f":"IF(E73=0,0,E73+E74)","v":0},{"$f":"IF(F73=0,0,F73+F74)","v":0},{"$f":"G73+G74","v":0},{"$f":"H73+H74","v":0}]
[null,{"$f":"+Textes!A162","v":"Pour 365 jours"},null,null,{"$f":"IF(C75=0,0,E75/C75*365)","v":0},{"$f":"IF(C75=0,0,F75/C75*365)","v":0},{"$f":"IF(C75=0,0,G75/C75*365)","v":0},{"$f":"IF(C75=0,0,H75/C75*365)","v":0},{"$f":"+Textes!A164","v":"=> Contrôle avec les valeurs minimales"}]
[]
[null,{"$f":"+Textes!A165","v":"Pas D: Données de contrôle"},null,null,null,null,{"$f":"+Textes!A178","v":"Bilan animaux"},null,{"$f":"+Textes!A200","v":"< 60 kg PV"},null,{"$f":"IF(Textes!G2=1,Textes!A201,\"\")","v":"> 60 kg PV"}]
[]
[null,{"$f":"+Textes!A166","v":"Aliment 88% MS pour 365 j"},null,null,{"$f":"IF(C75=0,0,R68/C75*365)","v":0},"kg",null,null,{"$f":"+Textes!A179","v":"Nombre"},{"$f":"+Textes!A180","v":"kg PV"},{"$f":"IF(Textes!G2=1,I80,\"\")","v":"Nombre"},{"$f":"IF(Textes!G2=1,J80,\"\")","v":"kg PV"},null,"Total Anzahl Tiere Zukauf",null,null,null,null,{"$f":"IF(R68>0,IF(1-R69/R68>0.15,1,0),0)","v":0},{"$f":"IF(Textes!G2=1,Textes!A173,0)","v":"Fourrages > 15 % ?"},null,null,null,null,null,"Gewicht pro Tier"]
[null,{"$f":"+Textes!A167","v":"Aliment 88% MS par kg croît"},null,null,{"$f":"IF(H14=0,0,R68/H14)","v":0},"kg / kg",{"$f":"+Textes!A181","v":"Inventaire début"},null,{"$f":"IF(Textes!G2=1,Inv!N23,Inv!F23)","v":0},{"$f":"IF(Inv!N23=0,0,IF(Textes!G2=1,Inv!O23/Inv!N23,Inv!G23))","v":0},{"$f":"IF(Textes!G2=1,Inv!P23,0)","v":0},{"$f":"IF(Inv!P23=0,0,IF(Textes!G2=1,Inv!Q23/Inv!P23,0))","v":0},null,"bis 60 Kg",null,null,{"$f":"A1a!C61+A1b!C61+A1c!C61+A1d!C61+A1e!C61","v":0},null,null,null,null,null,null,{"$f":"A1a!D61+A1b!D61+A1c!D61+A1d!D61+A1e!D61","v":0},null,{"$f":"IF(Q81=0,0,X81/Q81)","v":0}]
[null,{"$f":"+Textes!A168","v":"Aliment g MA / MJ EDP"},null,null,{"$f":"IF(Textes!G2=1,S82,0)","v":0},"g / MJ",{"$f":"+Textes!A182","v":"Entrées"},{"$f":"Textes!A185","v":"Période"},{"$f":"+Q81","v":0},{"$f":"IF(Z81=0,0,Z81)","v":0},{"$f":"IF(Textes!G2=1,Q82,0)","v":0},{"$f":"IF(Z82=0,0,IF(Textes!G2=1,Z82,0))","v":0},null,"ab 60 Kg",null,null,{"$f":"A1a!F61+A1b!F61+A1c!F61+A1d!F61+A1e!F61","v":0},null,{"$f":"IF($S$80=1,S68,S69)","v":0},{"$f":"B82","v":"Aliment g MA / MJ EDP"},null,null,null,{"$f":"A1a!G61+A1b!G61+A1c!G61+A1d!G61+A1e!G61","v":0},null,{"$f":"IF(Q82=0,0,X82/Q82)","v":0}]
[null,{"$f":"+Textes!A170","v":"MJ consommés en 365 jours"},null,null,{"$f":"IF(ISERROR(Q68/C75*365)=TRUE,0,(Q68/C75*365))","v":0},"MJ",{"$f":"+Textes!A183","v":"Sorties"},{"$f":"Textes!A185","v":"Période"},{"$f":"+Q85","v":0},{"$f":"IF(X85=0,0,Z85)","v":0},{"$f":"IF(Textes!G2=1,Q86,0)","v":0},{"$f":"IF(Z86=0,0,IF(Textes!G2=1,Z86,0))","v":0},null,null,null,null,null,null,null,{"$f":"IF($Q$68>0,IF($S$80=1,T68,T69),0)","v":0}]
[null,{"$f":"+Textes!A169","v":"MJ / kg croît"},null,null,{"$f":"IF(H14=0,0,Q68/H14)","v":0},"MJ / kg",{"$f":"+Textes!A182","v":"Entrées"},{"$f":"Textes!A186","v":"365 jours"},{"$f":"IF(C75=0,0,+Q81/C75*365)","v":0},{"$f":"IF(Z81=0,0,Z81)","v":0},{"$f":"IF(AND(Textes!G2=1,C75<>0),Q82/C75*365,0)","v":0},{"$f":"IF(Z82=0,0,IF(Textes!G2=1,Z82,0))","v":0},null,"Total Anzahl Tiere Verkauf"]
[null,{"$f":"IF(Textes!G2=1,Textes!A172,0)","v":"dt MS de Fourrages par an"},null,null,{"$f":"IF(AND(Textes!G2=1,C75<>0),SUM(F65:F67)/100/C75*365,0)","v":0},{"$f":"IF(Textes!G2=1,Textes!A195,0)","v":"dt MS"},{"$f":"+Textes!A183","v":"Sorties"},{"$f":"Textes!A186","v":"365 jours"},{"$f":"IF(C75=0,0,+Q85/C75*365)","v":0},{"$f":"IF(X85=0,0,Z85)","v":0},{"$f":"IF(AND(Textes!G2=1,C75<>0),Q86/C75*365,0)","v":0},{"$f":"IF(Z86=0,0,IF(Textes!G2=1,Z86,0))","v":0},null,"bis 60 Kg",null,null,{"$f":"A2a!C61+A2b!C61+A2c!C61+A2d!C61+A2e!C61","v":0},null,null,null,null,null,null,{"$f":"A2a!D61+A2b!D61+A2c!D61+A2d!D61+A2e!D61","v":0},null,{"$f":"IF(Q85=0,0,X85/Q85)","v":0}]
[null,{"$f":"+Textes!A176","v":"Croît total par an"},null,null,{"$f":"IF(C75=0,0,H14/C75*365)","v":0},"kg",{"$f":"+Textes!A184","v":"Inventaire fin"},null,{"$f":"IF(Textes!G2=1,Inv!R23,Inv!I23)","v":0},{"$f":"IF(Inv!R23=0,0,IF(Textes!G2=1,Inv!S23/Inv!R23,Inv!J23))","v":0},{"$f":"IF(Textes!G2=1,Inv!T23,0)","v":0},{"$f":"IF(Inv!T23=0,0,IF(Textes!G2=1,Inv!U23/Inv!T23,0))","v":0},null,"ab 60 Kg",null,null,{"$f":"A2a!F61+A2b!F61+A2c!F61+A2d!F61+A2e!F61","v":0},null,null,null,null,null,null,{"$f":"A2a!G61+A2b!G61+A2c!G61+A2d!G61+A2e!G61","v":0},null,{"$f":"IF(Q86=0,0,X86/Q86)","v":0}]
[null,{"$f":"IF(Textes!G2=1,IF(AND(I88<20,L82<100),Textes!A177,0),0)","v":"PPE à partir du croît"},null,null,{"$f":"IF(E86=0,0,IF(Textes!G2=1,IF(AND(I88<20,L82<100),E86 / 272,0),0))","v":0},{"$f":"IF(B87<>0,Textes!A198,0)","v":"PPE"},{"$f":"+Textes!A189","v":"Bilan"},{"$f":"Textes!A185","v":"Période"},{"$f":"IF(I83-I81-I82+I86=0,0.0001,I83-I81-I82+I86)","v":1E-4},null,{"$f":"IF(Textes!G2=1,IF(K83-K81-K82+K86=0,0.0001,K83-K81-K82+K86),0)","v":1E-4}]
[null,null,null,null,null,null,{"$f":"+Textes!A190","v":"Bilan total"},null,{"$f":"IF((-I81-I82+I83+I86-K81-K82+K83+K86)=0,0.0001,-I81-I82+I83+I86-K81-K82+K83+K86)","v":1E-4},null,{"$f":"Textes!A187","v":"(Période)"}]
[]
[null,{"$f":"+Textes!A191","v":"L'exploitant autorise le calcul du Suisse-Bilanz"}]
[null,{"$f":"+Textes!A192","v":"avec le résultat de ce bilan import/export"}]
[]
[null,{"$f":"+Textes!A194","v":"Organisation de contrôle, Date:"},null,null,null,null,null,{"$f":"+Textes!A199","v":"Signature:"}]
[]
[null,{"$f":"+Textes!A193","v":"Exploitant, Date:"},null,null,null,null,null,{"$f":"+H93","v":"Signature:"}]

{"sheet":"Plausi","index":27,"n_rows":39,"n_cols":11,"rows_kept":39,"cut":false,"hidden":false,"merged":[]}
[null,null,null,"Impex",null,null,null,null,null,null,{"$f":"+Textes!A202","v":"Calcul des valeurs minimales"}]
[null,{"$f":"Inv!C4&IF(Inv!D4=0,\"\",Inv!D4)","v":"No cantonal:    "},null,{"$f":"Inv!C5 & IF(Inv!D5=0,\"\",Inv!D6 & \" \" & Inv!D5)","v":"Nom:    "}]
[]
[null,null,null,null,null,null,null,null,{"$f":"+Textes!A266","v":"Total"}]
[null,{"$f":"+Textes!A203","v":"Catégorie d'animaux"},{"$f":"+Textes!A225","v":"Unité"},{"$f":"+Textes!A228","v":"Définition de l'unité"},{"$f":"+Textes!A257","v":"Nombre"},{"$f":"+Textes!A258","v":"N"},{"$f":"+Textes!A259","v":"Nstock"},{"$f":"+Textes!A260","v":"P2O5"},"N",{"$f":"+G5","v":"Nstock"},{"$f":"+H5","v":"P2O5"}]
[null,{"$f":"+Textes!A204","v":"Porc à l'engrais/de remonte"},{"$f":"+Textes!A226","v":"Place"},{"$f":"+Textes!A229","v":"272 kg croît/année ; FV 2.6; 3.32 rotations"},null,8.4,{"$f":"ROUND(F6*0.8,2)","v":6.72},2.8,{"$f":"+E6*F6","v":0},{"$f":"+E6*G6","v":0},{"$f":"+E6*H6","v":0}]
[null,{"$f":"+Textes!A205","v":"Porc à l'engrais/de remonte"},{"$f":"+Textes!A227","v":"Animal"},{"$f":"+Textes!A230","v":"82 kg croît; FV 2.6"},null,2.54,2.0299999999999998,0.85,{"$f":"+E7*F7","v":0},{"$f":"+E7*G7","v":0},{"$f":"+E7*H7","v":0}]
[null,{"$f":"+Textes!A206","v":"Truie d'élevage avec porcelets < 26 kg PV"},{"$f":"+Textes!A226","v":"Place"},{"$f":"+Textes!A231","v":"Ø des effectifs début et fin "},null,31.4,25.12,11.5,0,0,0]
[null,{"$f":"+Textes!A207","v":"Verrat"},{"$f":"+Textes!A226","v":"Place"},{"$f":"+Textes!A232","v":"Ø des effectifs début et fin "},null,12.2,9.76,5.8,0,0,0]
[null,{"$f":"+Textes!A208","v":"Truie non allaitante"},{"$f":"+Textes!A226","v":"Place"},{"$f":"+Textes!A233","v":"Calcul en fonction des rotations ou des jours d'affouragement, voir remarque"},null,14.5,11.6,7.2,0,0,0]
[null,{"$f":"+Textes!A209","v":"Truie non allaitante"},{"$f":"+Textes!A227","v":"Animal"},{"$f":"+Textes!A234","v":"Ø (achats 365 j + sortie 365 j)"},null,4.93,3.94,2.4500000000000002,0,0,0]
[null,{"$f":"+Textes!A210","v":"Truie allaitante"},{"$f":"+Textes!A226","v":"Place"},{"$f":"+Textes!A233","v":"Calcul en fonction des rotations ou des jours d'affouragement, voir remarque"},null,33.700000000000003,26.96,12.7,0,0,0]
[null,{"$f":"+Textes!A211","v":"Truie allaitante"},{"$f":"+Textes!A227","v":"Animal"},{"$f":"+Textes!A236","v":"Ø (achats 365 j + sortie 365 j)"},null,3.42,2.74,1.29,0,0,0]
[null,{"$f":"+Textes!A212","v":"Porcelet sevré, d'env. 8 à 26 kg PV"},{"$f":"+Textes!A226","v":"Place"},{"$f":"+Textes!A237","v":"173 kg croît/année ; FV 1.68; 9.61 rotations"},null,2.56,2.0499999999999998,0.63,0,0,0]
[null,{"$f":"+Textes!A213","v":"Porcelet sevré, d'env. 8 à 26 kg PV"},{"$f":"+Textes!A227","v":"Animal"},{"$f":"+Textes!A238","v":"18 kg croît; FV 1.68"},null,0.27,0.22,7.0000000000000007E-2,0,0,0]
[null,{"$f":"+Textes!A214","v":"Poulettes"},{"$f":"+Textes!A221","v":"100 places"},{"$f":"+Textes!A239","v":"Moyenne des poulettes; 2.25 rotations"},null,21,{"$f":"ROUND(F16*0.6,2)","v":12.6},11.9,0,0,0]
[null,{"$f":"+Textes!A214","v":"Poulettes"},{"$f":"+Textes!A222","v":"100 animaux"},null,null,9.33,5.6,5.29,0,0,0]
[null,{"$f":"+Textes!A215","v":"Poulets à l'engrais"},{"$f":"+Textes!A221","v":"100 places"},{"$f":"+Textes!A240","v":"Effectif moyen des poulets à l'engrais pour l'éval. des valeurs minimales"},null,26,15.6,7,{"$f":"+E18*F18","v":0},{"$f":"+E18*G18","v":0},{"$f":"+E18*H18","v":0}]
[null,{"$f":"Textes!A216","v":"Dindes à l'engrais"},{"$f":"+Textes!A221","v":"100 places"},{"$f":"Textes!A241","v":"Moyenne des dindes à l'engrais; 2.8 rotations"},null,91,54.6,49,0,0,0]
[null,{"$f":"Textes!A217","v":"Dindes avancement"},{"$f":"+Textes!A221","v":"100 places"},{"$f":"Textes!A219","v":"<= 1.5 kg PV, 6 rotations"},null,26,15.6,14.4,0,0,0]
[null,{"$f":"Textes!A218","v":"Dindes finition"},{"$f":"+Textes!A221","v":"100 places"},{"$f":"Textes!A220","v":"> 1.5 - 13 kg PV, 2.9 rotations"},null,149.5,89.7,80.2,0,0,0]
[null,{"$f":"+Textes!A223","v":"Lapine mère, y.c. petits < 35 j."},{"$f":"+Textes!A227","v":"Animal"},{"$f":"+Textes!A242","v":"Moyenne des lapins mère"},null,1.82,{"$f":"ROUND(F22*0.85,2)","v":1.55},1.05,0,0,0]
[null,{"$f":"+Textes!A224","v":"Lapins d'engraissement > 35 j."},{"$f":"+Textes!A221","v":"100 places"},{"$f":"+Textes!A243","v":"Moyenne des lapins d'engraissement"},null,55.3,{"$f":"ROUND(F23*0.85,2)","v":47.01},33.6,0,0,0]
[null,{"$f":"+Textes!A263","v":"Valeur minimale pour l'exploitation"},null,null,null,null,null,null,{"$f":"SUM(I6:I23)","v":0},{"$f":"SUM(J6:J23)","v":0},{"$f":"SUM(K6:K23)","v":0}]
[null,{"$f":"+Textes!A264","v":"Valeur calculée par le bilan import/export"},null,null,null,null,null,null,{"$f":"+Impex!E76","v":0},{"$f":"+Impex!G76","v":0},{"$f":"+Impex!H76","v":0}]
[null,{"$f":"+Textes!A265","v":"Valeur à reporter dans le Suisse-Bilanz"},null,null,null,null,null,null,{"$f":"IF(SUM(E6:E23)=0,0,IF(I25<I24,I24,I25))","v":0},{"$f":"IF(SUM(F6:F23)=0,0,IF(J25<J24,J24,J25))","v":0},{"$f":"IF(SUM(G6:G23)=0,0,IF(K25<K24,K24,K25))","v":0}]
[]
[null,{"$f":"Textes!A244","v":"Remarques pour le calcul du cheptel moyen chez les porcs :"},null,null,null,null,{"$f":"Textes!A245","v":"      Remarque :"}]
[null,{"$f":"Textes!A246","v":"- Les exploitations mixtes tiennent compte pour les porcs à l'engrais d'une croissance de 272 kg, de l'inventaire, de leur propre remonte,"}]
[null,{"$f":"Textes!A247","v":" ainsi que d'éventuels porcelets en surpoids (=> tous les croîts entre 26 et 108 kg PV)."}]
[null,{"$f":"Textes!A248","v":"- Places truie d'élevage et places verrat: des éventuelles fluctuations annuelles justifient un écart de la moyenne des cheptels début et fin."}]
[null,{"$f":"Textes!A249","v":"- Places truie non allaitante : nombre de places calculé en fonction de rotations: valeur moyenne (achats 365 j + sortie 365 j) divisée par 2.94 rotations"}]
[null,{"$f":"Textes!A250","v":"       ou par les jours d’affouragement. Le cheptel moyen peut atteindre au plus la moyenne des animaux en stabulation."}]
[null,{"$f":"Textes!A251","v":"       Augmentation de poids entre entrée et sortie des animaux: valeur standard 35 kg (y. c. remontes et truites de réforme) ou peser tous les animaux."}]
[null,{"$f":"Textes!A252","v":"- Places truie allaitante: nombre de places calculé en fonction de rotations: valeur moyenne (achats 365 j + sortie 365 j) divisée par 9.86 rotations"}]
[null,{"$f":"Textes!A253","v":"       ou par les jours d’affouragement. Le cheptel moyen peut atteindre au plus la moyenne des animaux en stabulation."}]
[null,{"$f":"Textes!A254","v":"       Diminution de poids entre entrée et sortie des animaux: valeur standard 35 kg (y. c. remontes et truites de réforme) ou peser tous les animaux."}]
[null,{"$f":"Textes!A255","v":"- Les exploitations de mise bas avec élevage tiennent compte d'un croît de 173 kg et de l'inventaire"}]
[null,{"$f":"Textes!A256","v":"        (=> tous les croîts entre 8 et 26 kg PV)."}]

{"sheet":"Poulet1","index":28,"n_rows":179,"n_cols":20,"rows_kept":179,"cut":false,"hidden":true,"merged":[[168,3,169,3],[168,4,169,4],[165,3,166,3],[159,4,160,4],[165,4,166,4],[162,4,163,4],[162,3,163,3]]}
[]
[null,null,null,null,null,null,null,null,null,null,null,{"$f":"Textes!A267","v":"Poulailler 1"}]
[null,{"$f":"Textes!A273","v":"Attention: "}]
[null,{"$f":"Textes!A274","v":"               Travaux commencés avant la période et non terminés pendant la période sont à saisir entièrement !"}]
[]
[null,{"$f":"Textes!A19","v":"Période:"},null,null,{"$f":"Textes!A20","v":"Date début:"},{"$f":"IF(Inv!I8=0,\"\",Inv!I8)","v":""},null,{"$f":"Textes!A21","v":"Date fin:"},{"$f":"IF(Inv!I9=0,\"\",Inv!I9)","v":""},{"$f":"Textes!A22","v":"Durée en jours:"},{"$f":"IF(OR(F6=\"\",I6=\"\"),\"\",I6-F6+1)","v":""}]
[null,null,null,null,null,{"$f":"YEAR(F6)","v":{"$error":"#VALUE!"}}]
[null,{"$f":"+Textes!A9","v":"No cantonal:"},null,null,{"$f":"IF(Inv!D4=0,\"\",Inv!D4)","v":""}]
[null,{"$f":"+Textes!A10","v":"Nom:"},null,null,{"$f":"IF(Inv!D5=0,\"\",Inv!D6 & \" \" & Inv!D5)","v":""}]
[null,{"$f":"+Textes!A13","v":"Adresse:"},null,null,{"$f":"IF(Inv!D7=0,\"\",Inv!D7)","v":""}]
[null,{"$f":"+Textes!A14","v":"NPA, lieu:"},null,null,{"$f":"IF(Inv!D9=0,\"\",Inv!D9)","v":""}]
[]
[null,null,null,null,null,null,null,{"$f":"Textes!A278","v":"Jours "},null,{"$f":"Textes!A282","v":"Nbre d'ani-"},{"$f":"Textes!A285","v":"Nombre déter-"},null,null,null,null,"Erkennen",null,{"$f":"I15","v":"Coefficient"},{"$f":"J13","v":"Nbre d'ani-"},{"$f":"D15","v":"Nombre d'animaux"}]
[null,null,null,null,null,null,"Tier-",{"$f":"Textes!A279","v":"d'engrais-"},null,{"$f":"Textes!A283","v":"maux abattus"},{"$f":"Textes!A286","v":"minant d'animaux"},null,null,null,"Datum ","letzter Umtrieb",null,{"$f":"Textes!A288","v":"pour valeurs"},{"$f":"J14","v":"maux abattus"},{"$f":"K15","v":"par rotation"}]
[null,{"$f":"Textes!A275","v":"Date"},null,{"$f":"Textes!A276","v":"Nombre d'animaux"},null,{"$f":"Textes!A277","v":"kg PV total"},"Bestand",{"$f":"Textes!A280","v":"sement"},{"$f":"Textes!A281","v":"Coefficient"},{"$f":"Textes!A284","v":"x coefficient"},{"$f":"Textes!A287","v":"par rotation"},null,null,null,"(Hilfswert)","für Abgrenzung",null,{"$f":"Textes!A289","v":"minimales (vm)"},"x coefficient",{"$f":"Textes!A290","v":"pour vm"}]
[null,{"$f":"Textes!A291","v":"Rotation 1"},{"$f":"Jahr","v":{"$error":"#VALUE!"}}]
[null,null,{"$f":"IF(ISERROR(Jahr), \"\", IF($F$6>B17,\"\",IF(B17>$I$6,Jahr + 1,Jahr)))","v":""},null,{"$f":"Textes!A303","v":"Mise en poulailler"},{"$f":"D17*0.04","v":0},{"$f":"IF(D17>0,D17,0)","v":0},null,null,null,null,null,{"$f":"IF(OR(B17=\"\",D17=\"\"),0,IF(B17<F$6,H17+(F$6-B17)-1,IF((I$6-B17)=0,1,H17+(I$6-B17))))","v":0},{"$f":"IF(D17=\"\",0,IF(M17=0,VLOOKUP(1,Faktoren!$B$16:$D$55,2)/1000,VLOOKUP(M17,Faktoren!$B$16:$D$55,2)/1000))","v":0},null,null,null,{"$f":"IF(AND(H17 > 0, B17 > 0), LOOKUP(H17,INDEX(Faktoren!data,,1),INDEX(Faktoren!data,,5)),0)","v":0},{"$f":"D17:D23 * R17:R23","v":0}]
[null,null,"",null,{"$f":"Textes!A304","v":"1er abattage"},null,{"$f":"IF(D17-D18>0,D17-D18,0)","v":0},{"$f":"IF(AND(D18>0,B18>0),B18-B17+1,0)","v":0},{"$f":"IF(H18>0,IF(H18>Faktoren!$D$5,Faktoren!$E$4,Faktoren!$E$5),0)","v":0},{"$f":"IF(H18>0,D18*I18,0)","v":0},null,null,{"$f":"IF(OR(B18=\"\",D18=\"\"),0,IF(B18<F$6,H18+(F$6-B18)-1,H18+(I$6-B18)))","v":0},{"$f":"IF(OR(D18=\"\",M18=0),0,VLOOKUP(M18,Faktoren!$B$16:$D$55,2)/1000)","v":0},null,null,null,{"$f":"IF(AND(H18 > 0, B18 > 0), LOOKUP(H18,INDEX(Faktoren!data,,1),INDEX(Faktoren!data,,5)),0)","v":0},0]
[null,null,"",null,{"$f":"Textes!A305","v":"2e abattage"},null,{"$f":"IF(D17-D18-D19>0,D17-D18-D19,0)","v":0},{"$f":"IF(AND(D19>0,B19>0),B19-B17+1,0)","v":0},{"$f":"IF(H19>0,IF(H19>Faktoren!$D$5,Faktoren!$E$4,Faktoren!$E$5),0)","v":0},{"$f":"IF(H19>0,D19*I19,0)","v":0},null,null,{"$f":"IF(OR(B19=\"\",D19=\"\"),0,IF(B19<F$6,H19+(F$6-B19)-1,H19+(I$6-B19)))","v":0},{"$f":"IF(OR(D19=\"\",M19=0),0,VLOOKUP(M19,Faktoren!$B$16:$D$55,2)/1000)","v":0},null,null,null,{"$f":"IF(AND(H19 > 0, B19 > 0), LOOKUP(H19,INDEX(Faktoren!data,,1),INDEX(Faktoren!data,,5)),0)","v":0},0]
[null,null,"",null,{"$f":"Textes!A306","v":"3e abattage"},null,{"$f":"IF(D17-D18-D19-D20>0,D17-D18-D19-D20,0)","v":0},{"$f":"IF(AND(D20>0,B20>0),B20-B17+1,0)","v":0},{"$f":"IF(H20>0,IF(H20>Faktoren!$D$5,Faktoren!$E$4,Faktoren!$E$5),0)","v":0},{"$f":"IF(H20>0,D20*I20,0)","v":0},null,null,{"$f":"IF(OR(B20=\"\",D20=\"\"),0,IF(B20<F$6,H20+(F$6-B20)-1,H20+(I$6-B20)))","v":0},{"$f":"IF(OR(D20=\"\",M20=0),0,VLOOKUP(M20,Faktoren!$B$16:$D$55,2)/1000)","v":0},null,null,null,{"$f":"IF(AND(H20 > 0, B20 > 0), LOOKUP(H20,INDEX(Faktoren!data,,1),INDEX(Faktoren!data,,5)),0)","v":0},0]
[null,null,"",null,{"$f":"Textes!A307","v":"4e abattage"},null,{"$f":"IF(D17-D18-D19-D20-D21>0,D17-D18-D19-D20-D21,0)","v":0},{"$f":"IF(AND(D21>0,B21>0),B21-B17+1,0)","v":0},{"$f":"IF(H21>0,IF(H21>Faktoren!$D$5,Faktoren!$E$4,Faktoren!$E$5),0)","v":0},{"$f":"IF(H21>0,D21*I21,0)","v":0},null,null,{"$f":"IF(OR(B21=\"\",D21=\"\"),0,IF(B21<F$6,H21+(F$6-B21)-1,H21+(I$6-B21)))","v":0},{"$f":"IF(OR(D21=\"\",M21=0),0,VLOOKUP(M21,Faktoren!$B$16:$D$55,2)/1000)","v":0},null,null,null,{"$f":"IF(AND(H21 > 0, B21 > 0), LOOKUP(H21,INDEX(Faktoren!data,,1),INDEX(Faktoren!data,,5)),0)","v":0},0]
[null,null,"",null,{"$f":"Textes!A308","v":"5e abattage"},null,{"$f":"IF(D17-D18-D19-D20-D21-D22>0,D17-D18-D19-D20-D21-D22,0)","v":0},{"$f":"IF(AND(D22>0,B22>0),B22-B17+1,0)","v":0},{"$f":"IF(H22>0,IF(H22>Faktoren!$D$5,Faktoren!$E$4,Faktoren!$E$5),0)","v":0},{"$f":"IF(H22>0,D22*I22,0)","v":0},null,null,{"$f":"IF(OR(B22=\"\",D22=\"\"),0,IF(B22<F$6,H22+(F$6-B22)-1,H22+(I$6-B22)))","v":0},{"$f":"IF(OR(D22=\"\",M22=0),0,VLOOKUP(M22,Faktoren!$B$16:$D$55,2)/1000)","v":0},null,null,null,{"$f":"IF(AND(H22 > 0, B22 > 0), LOOKUP(H22,INDEX(Faktoren!data,,1),INDEX(Faktoren!data,,5)),0)","v":0},0]
[null,{"$f":"IF(SUM(B17:B22) > 0,E23,\"\")","v":""},null,{"$f":"+D17-SUM(D18:D22)","v":0},{"$f":"Textes!A309","v":"pertes"},{"$f":"D23*0.6","v":0},null,null,{"$f":"IF(D23>0,Faktoren!$E$7,0)","v":0},{"$f":"IF(D23>0,D23*I23,0)","v":0},{"$f":"SUM(J18:J23)","v":0},null,{"$f":"IF(B17=F6,G17,IF(MIN(B17:B22)>$F$6,0,VLOOKUP($F$6,B17:G22,6)))","v":0},null,{"$f":"MAX(B17:B22)","v":"00:00:00"},{"$f":"IF(OR($F$6=\"\",I$6=\"\",O23<F$6),99,IF(AND(B17>=F$6,O23<=I$6),0,IF(AND(B17>=F$6,O23>I$6),2,1)))","v":99},null,{"$f":"IF(AND(H23 > 0, B23 > 0), LOOKUP(H23,INDEX(Faktoren!data,,1),INDEX(Faktoren!data,,5)),0)","v":0},0,{"$f":"SUM(S17:S23)","v":0}]
[null,null,null,{"$f":"IF(D17>0,ROUND(+D23/D17*100,1),0)","v":0},{"$f":"Textes!A310","v":"pertes en %"},null,"belegt",{"$f":"MAX(H17:H22)","v":0},{"$f":"Textes!A312","v":"jours poulailler occupé"},null,null,null,null,{"$f":"IF(P23=1,O23-$F$6+1,H24)","v":0}]
[null,null,null,{"$f":"IF(P23=99,0,IF(P23=0,H24/MAX(H18:H22),IF(P23=1,(O23-$F$6)/H24,(H24-(O23-I$6))/H24)))","v":0},{"$f":"Textes!A311","v":"Rotations"},null,null,{"$f":"IF(B27<>0,(B27-O23),0)","v":0},{"$f":"Textes!A313","v":"jours poulailler inoccupé"}]
[null,{"$f":"Textes!A292","v":"Rotation 2"}]
[null,null,{"$f":"IF(ISERROR(Jahr), \"\", IF($F$6>B27,\"\",IF(B27>$I$6,Jahr + 1,Jahr)))","v":""},null,{"$f":"Textes!A303","v":"Mise en poulailler"},{"$f":"D27*0.04","v":0},{"$f":"IF(D27>0,D27,0)","v":0},null,null,null,null,null,{"$f":"IF(OR(B27=\"\",D27=\"\"),0,IF((I$6-B27)=0,1,H27+(I$6-B27)))","v":0},{"$f":"IF(D27=\"\",0,VLOOKUP(M27,Faktoren!$B$16:$D$55,2)/1000)","v":0},null,null,null,{"$f":"IF(AND(H27 > 0, B27 > 0), LOOKUP(H27,INDEX(Faktoren!data,,1),INDEX(Faktoren!data,,5)),0)","v":0},{"$f":"D27:D33 * R27:R33","v":0}]
[null,null,"",null,{"$f":"Textes!A304","v":"1er abattage"},null,{"$f":"IF(D27-D28>0,D27-D28,0)","v":0},{"$f":"IF(AND(D28>0,B28>0),B28-B27+1,0)","v":0},{"$f":"IF(H28>0,IF(H28>Faktoren!$D$5,Faktoren!$E$4,Faktoren!$E$5),0)","v":0},{"$f":"IF(H28>0,D28*I28,0)","v":0},null,null,{"$f":"IF(OR(B28=\"\",D28=\"\"),0,H28+(I$6-B28))","v":0},{"$f":"IF(D28=\"\",0,VLOOKUP(M28,Faktoren!$B$16:$D$55,2)/1000)","v":0},null,null,null,{"$f":"IF(AND(H28 > 0, B28 > 0), LOOKUP(H28,INDEX(Faktoren!data,,1),INDEX(Faktoren!data,,5)),0)","v":0},0]
[null,null,"",null,{"$f":"Textes!A305","v":"2e abattage"},null,{"$f":"IF(D27-D28-D29>0,D27-D28-D29,0)","v":0},{"$f":"IF(AND(D29>0,B29>0),B29-B27+1,0)","v":0},{"$f":"IF(H29>0,IF(H29>Faktoren!$D$5,Faktoren!$E$4,Faktoren!$E$5),0)","v":0},{"$f":"IF(H29>0,D29*I29,0)","v":0},null,null,{"$f":"IF(OR(B29=\"\",D29=\"\"),0,H29+(I$6-B29))","v":0},{"$f":"IF(D29=\"\",0,VLOOKUP(M29,Faktoren!$B$16:$D$55,2)/1000)","v":0},null,null,null,{"$f":"IF(AND(H29 > 0, B29 > 0), LOOKUP(H29,INDEX(Faktoren!data,,1),INDEX(Faktoren!data,,5)),0)","v":0},0]
[null,null,"",null,{"$f":"Textes!A306","v":"3e abattage"},null,{"$f":"IF(D27-D28-D29-D30>0,D27-D28-D29-D30,0)","v":0},{"$f":"IF(AND(D30>0,B30>0),B30-B27+1,0)","v":0},{"$f":"IF(H30>0,IF(H30>Faktoren!$D$5,Faktoren!$E$4,Faktoren!$E$5),0)","v":0},{"$f":"IF(H30>0,D30*I30,0)","v":0},null,null,{"$f":"IF(OR(B30=\"\",D30=\"\"),0,H30+(I$6-B30))","v":0},{"$f":"IF(D30=\"\",0,VLOOKUP(M30,Faktoren!$B$16:$D$55,2)/1000)","v":0},null,null,null,{"$f":"IF(AND(H30 > 0, B30 > 0), LOOKUP(H30,INDEX(Faktoren!data,,1),INDEX(Faktoren!data,,5)),0)","v":0},0]
[null,null,"",null,{"$f":"Textes!A307","v":"4e abattage"},null,{"$f":"IF(D27-D28-D29-D30-D31>0,D27-D28-D29-D30-D31,0)","v":0},{"$f":"IF(AND(D31>0,B31>0),B31-B27+1,0)","v":0},{"$f":"IF(H31>0,IF(H31>Faktoren!$D$5,Faktoren!$E$4,Faktoren!$E$5),0)","v":0},{"$f":"IF(H31>0,D31*I31,0)","v":0},null,null,{"$f":"IF(OR(B31=\"\",D31=\"\"),0,H31+(I$6-B31))","v":0},{"$f":"IF(D31=\"\",0,VLOOKUP(M31,Faktoren!$B$16:$D$55,2)/1000)","v":0},null,null,null,{"$f":"IF(AND(H31 > 0, B31 > 0), LOOKUP(H31,INDEX(Faktoren!data,,1),INDEX(Faktoren!data,,5)),0)","v":0},0]
[null,null,"",null,{"$f":"Textes!A308","v":"5e abattage"},null,{"$f":"IF(D27-D28-D29-D30-D31-D32>0,D27-D28-D29-D30-D31-D32,0)","v":0},{"$f":"IF(AND(D32>0,B32>0),B32-B27+1,0)","v":0},{"$f":"IF(H32>0,IF(H32>Faktoren!$D$5,Faktoren!$E$4,Faktoren!$E$5),0)","v":0},{"$f":"IF(H32>0,D32*I32,0)","v":0},null,null,{"$f":"IF(OR(B32=\"\",D32=\"\"),0,H32+(I$6-B32))","v":0},{"$f":"IF(D32=\"\",0,VLOOKUP(M32,Faktoren!$B$16:$D$55,2)/1000)","v":0},null,null,null,{"$f":"IF(AND(H32 > 0, B32 > 0), LOOKUP(H32,INDEX(Faktoren!data,,1),INDEX(Faktoren!data,,5)),0)","v":0},0]
[null,{"$f":"IF(SUM(B27:B32) > 0,E33,\"\")","v":""},null,{"$f":"+D27-SUM(D28:D32)","v":0},{"$f":"Textes!A309","v":"pertes"},{"$f":"D33*0.6","v":0},null,null,{"$f":"IF(D33>0,Faktoren!$E$7,0)","v":0},{"$f":"IF(D33>0,D33*I33,0)","v":0},{"$f":"SUM(J28:J33)","v":0},null,{"$f":"IF(MAX(B27:B32)<$I$6,0,VLOOKUP($I$6,B27:G32,6))","v":0},null,{"$f":"MAX(B27:B32)","v":"00:00:00"},{"$f":"IF(OR($F$6=\"\",I$6=\"\",O33<F$6),99,IF(AND(O33>F$6,O33<=I$6),0,1))","v":99},null,{"$f":"IF(AND(H33 > 0, B33 > 0), LOOKUP(H33,INDEX(Faktoren!data,,1),INDEX(Faktoren!data,,5)),0)","v":0},0,{"$f":"SUM(S27:S33)","v":0}]
[null,null,null,{"$f":"IF(D27>0,ROUND(+D33/D27*100,1),0)","v":0},{"$f":"Textes!A310","v":"pertes en %"},null,"belegt",{"$f":"MAX(H27:H32)","v":0},{"$f":"Textes!A312","v":"jours poulailler occupé"},null,null,null,null,{"$f":"IF(P33=1,$I$6-B27+1,H34)","v":0}]
[null,null,null,{"$f":"IF(P33=99,0,IF(P33=0,H34/MAX(H28:H32),IF(P33=1,(H34-(O33-$I$6))/H34,0)))","v":0},{"$f":"Textes!A311","v":"Rotations"},null,null,{"$f":"IF(B37<>0,(B37-O33),0)","v":0},{"$f":"Textes!A313","v":"jours poulailler inoccupé"}]
[null,{"$f":"Textes!A293","v":"Rotation 3"}]
[null,null,{"$f":"IF(ISERROR(Jahr), \"\", IF($F$6>B37,\"\",IF(B37>$I$6,Jahr + 1,Jahr)))","v":""},null,{"$f":"Textes!A303","v":"Mise en poulailler"},{"$f":"D37*0.04","v":0},{"$f":"IF(D37>0,D37,0)","v":0},null,null,null,null,null,{"$f":"IF(OR(B37=\"\",D37=\"\"),0,IF((I$6-B37)=0,1,H37+(I$6-B37)))","v":0},{"$f":"IF(D37=\"\",0,VLOOKUP(M37,Faktoren!$B$16:$D$55,2)/1000)","v":0},null,null,null,{"$f":"IF(AND(H37 > 0, B37 > 0), LOOKUP(H37,INDEX(Faktoren!data,,1),INDEX(Faktoren!data,,5)),0)","v":0},{"$f":"D37:D43 * R37:R43","v":0}]
[null,null,"",null,{"$f":"Textes!A304","v":"1er abattage"},null,{"$f":"IF(D37-D38>0,D37-D38,0)","v":0},{"$f":"IF(AND(D38>0,B38>0),B38-B37+1,0)","v":0},{"$f":"IF(H38>0,IF(H38>Faktoren!$D$5,Faktoren!$E$4,Faktoren!$E$5),0)","v":0},{"$f":"IF(H38>0,D38*I38,0)","v":0},null,null,{"$f":"IF(OR(B38=\"\",D38=\"\"),0,H38+(I$6-B38))","v":0},{"$f":"IF(D38=\"\",0,VLOOKUP(M38,Faktoren!$B$16:$D$55,2)/1000)","v":0},null,null,null,{"$f":"IF(AND(H38 > 0, B38 > 0), LOOKUP(H38,INDEX(Faktoren!data,,1),INDEX(Faktoren!data,,5)),0)","v":0},0]
[null,null,"",null,{"$f":"Textes!A305","v":"2e abattage"},null,{"$f":"IF(D37-D38-D39>0,D37-D38-D39,0)","v":0},{"$f":"IF(AND(D39>0,B39>0),B39-B37+1,0)","v":0},{"$f":"IF(H39>0,IF(H39>Faktoren!$D$5,Faktoren!$E$4,Faktoren!$E$5),0)","v":0},{"$f":"IF(H39>0,D39*I39,0)","v":0},null,null,{"$f":"IF(OR(B39=\"\",D39=\"\"),0,H39+(I$6-B39))","v":0},{"$f":"IF(D39=\"\",0,VLOOKUP(M39,Faktoren!$B$16:$D$55,2)/1000)","v":0},null,null,null,{"$f":"IF(AND(H39 > 0, B39 > 0), LOOKUP(H39,INDEX(Faktoren!data,,1),INDEX(Faktoren!data,,5)),0)","v":0},0]
[null,null,"",null,{"$f":"Textes!A306","v":"3e abattage"},null,{"$f":"IF(D37-D38-D39-D40>0,D37-D38-D39-D40,0)","v":0},{"$f":"IF(AND(D40>0,B40>0),B40-B37+1,0)","v":0},{"$f":"IF(H40>0,IF(H40>Faktoren!$D$5,Faktoren!$E$4,Faktoren!$E$5),0)","v":0},{"$f":"IF(H40>0,D40*I40,0)","v":0},null,null,{"$f":"IF(OR(B40=\"\",D40=\"\"),0,H40+(I$6-B40))","v":0},{"$f":"IF(D40=\"\",0,VLOOKUP(M40,Faktoren!$B$16:$D$55,2)/1000)","v":0},null,null,null,{"$f":"IF(AND(H40 > 0, B40 > 0), LOOKUP(H40,INDEX(Faktoren!data,,1),INDEX(Faktoren!data,,5)),0)","v":0},0]
[null,null,"",null,{"$f":"Textes!A307","v":"4e abattage"},null,{"$f":"IF(D37-D38-D39-D40-D41>0,D37-D38-D39-D40-D41,0)","v":0},{"$f":"IF(AND(D41>0,B41>0),B41-B37+1,0)","v":0},{"$f":"IF(H41>0,IF(H41>Faktoren!$D$5,Faktoren!$E$4,Faktoren!$E$5),0)","v":0},{"$f":"IF(H41>0,D41*I41,0)","v":0},null,null,{"$f":"IF(OR(B41=\"\",D41=\"\"),0,H41+(I$6-B41))","v":0},{"$f":"IF(D41=\"\",0,VLOOKUP(M41,Faktoren!$B$16:$D$55,2)/1000)","v":0},null,null,null,{"$f":"IF(AND(H41 > 0, B41 > 0), LOOKUP(H41,INDEX(Faktoren!data,,1),INDEX(Faktoren!data,,5)),0)","v":0},0]
[null,null,"",null,{"$f":"Textes!A308","v":"5e abattage"},null,{"$f":"IF(D37-D38-D39-D40-D41-D42>0,D37-D38-D39-D40-D41-D42,0)","v":0},{"$f":"IF(AND(D42>0,B42>0),B42-B37+1,0)","v":0},{"$f":"IF(H42>0,IF(H42>Faktoren!$D$5,Faktoren!$E$4,Faktoren!$E$5),0)","v":0},{"$f":"IF(H42>0,D42*I42,0)","v":0},null,null,{"$f":"IF(OR(B42=\"\",D42=\"\"),0,H42+(I$6-B42))","v":0},{"$f":"IF(D42=\"\",0,VLOOKUP(M42,Faktoren!$B$16:$D$55,2)/1000)","v":0},null,null,null,{"$f":"IF(AND(H42 > 0, B42 > 0), LOOKUP(H42,INDEX(Faktoren!data,,1),INDEX(Faktoren!data,,5)),0)","v":0},0]
[null,{"$f":"IF(SUM(B37:B42) > 0,E43,\"\")","v":""},null,{"$f":"+D37-SUM(D38:D42)","v":0},{"$f":"Textes!A309","v":"pertes"},{"$f":"D43*0.6","v":0},null,null,{"$f":"IF(D43>0,Faktoren!$E$7,0)","v":0},{"$f":"IF(D43>0,D43*I43,0)","v":0},{"$f":"SUM(J38:J43)","v":0},null,{"$f":"IF(MAX(B37:B42)<$I$6,0,VLOOKUP($I$6,B37:G42,6))","v":0},null,{"$f":"MAX(B37:B42)","v":"00:00:00"},{"$f":"IF(OR($F$6=\"\",I$6=\"\",O43<F$6),99,IF(AND(O43>F$6,O43<=I$6),0,1))","v":99},null,{"$f":"IF(AND(H43 > 0, B43 > 0), LOOKUP(H43,INDEX(Faktoren!data,,1),INDEX(Faktoren!data,,5)),0)","v":0},0,{"$f":"SUM(S37:S43)","v":0}]
[null,null,null,{"$f":"IF(D37>0,ROUND(+D43/D37*100,1),0)","v":0},{"$f":"Textes!A310","v":"pertes en %"},null,"belegt",{"$f":"MAX(H37:H42)","v":0},{"$f":"Textes!A312","v":"jours poulailler occupé"},null,null,null,null,{"$f":"IF(P43=1,$I$6-B37+1,H44)","v":0}]
[null,null,null,{"$f":"IF(P43=99,0,IF(P43=0,H44/MAX(H38:H42),IF(P43=1,(H44-(O43-$I$6))/H44,0)))","v":0},{"$f":"Textes!A311","v":"Rotations"},null,null,{"$f":"IF(B47<>0,(B47-O43),0)","v":0},{"$f":"Textes!A313","v":"jours poulailler inoccupé"}]
[null,{"$f":"Textes!A294","v":"Rotation 4"}]
[null,null,{"$f":"IF(ISERROR(Jahr), \"\", IF($F$6>B47,\"\",IF(B47>$I$6,Jahr + 1,Jahr)))","v":""},null,{"$f":"Textes!A303","v":"Mise en poulailler"},{"$f":"D47*0.04","v":0},{"$f":"IF(D47>0,D47,0)","v":0},null,null,null,null,null,{"$f":"IF(OR(B47=\"\",D47=\"\"),0,IF((I$6-B47)=0,1,H47+(I$6-B47)))","v":0},{"$f":"IF(D47=\"\",0,VLOOKUP(M47,Faktoren!$B$16:$D$55,2)/1000)","v":0},null,null,null,{"$f":"IF(AND(H47 > 0, B47 > 0), LOOKUP(H47,INDEX(Faktoren!data,,1),INDEX(Faktoren!data,,5)),0)","v":0},{"$f":"D47:D53 * R47:R53","v":0}]
[null,null,"",null,{"$f":"Textes!A304","v":"1er abattage"},null,{"$f":"IF(D47-D48>0,D47-D48,0)","v":0},{"$f":"IF(AND(D48>0,B48>0),B48-B47+1,0)","v":0},{"$f":"IF(H48>0,IF(H48>Faktoren!$D$5,Faktoren!$E$4,Faktoren!$E$5),0)","v":0},{"$f":"IF(H48>0,D48*I48,0)","v":0},null,null,{"$f":"IF(OR(B48=\"\",D48=\"\"),0,H48+(I$6-B48))","v":0},{"$f":"IF(D48=\"\",0,VLOOKUP(M48,Faktoren!$B$16:$D$55,2)/1000)","v":0},null,null,null,{"$f":"IF(AND(H48 > 0, B48 > 0), LOOKUP(H48,INDEX(Faktoren!data,,1),INDEX(Faktoren!data,,5)),0)","v":0},0]
[null,null,"",null,{"$f":"Textes!A305","v":"2e abattage"},null,{"$f":"IF(D47-D48-D49>0,D47-D48-D49,0)","v":0},{"$f":"IF(AND(D49>0,B49>0),B49-B47+1,0)","v":0},{"$f":"IF(H49>0,IF(H49>Faktoren!$D$5,Faktoren!$E$4,Faktoren!$E$5),0)","v":0},{"$f":"IF(H49>0,D49*I49,0)","v":0},null,null,{"$f":"IF(OR(B49=\"\",D49=\"\"),0,H49+(I$6-B49))","v":0},{"$f":"IF(D49=\"\",0,VLOOKUP(M49,Faktoren!$B$16:$D$55,2)/1000)","v":0},null,null,null,{"$f":"IF(AND(H49 > 0, B49 > 0), LOOKUP(H49,INDEX(Faktoren!data,,1),INDEX(Faktoren!data,,5)),0)","v":0},0]
[null,null,"",null,{"$f":"Textes!A306","v":"3e abattage"},null,{"$f":"IF(D47-D48-D49-D50>0,D47-D48-D49-D50,0)","v":0},{"$f":"IF(AND(D50>0,B50>0),B50-B47+1,0)","v":0},{"$f":"IF(H50>0,IF(H50>Faktoren!$D$5,Faktoren!$E$4,Faktoren!$E$5),0)","v":0},{"$f":"IF(H50>0,D50*I50,0)","v":0},null,null,{"$f":"IF(OR(B50=\"\",D50=\"\"),0,H50+(I$6-B50))","v":0},{"$f":"IF(D50=\"\",0,VLOOKUP(M50,Faktoren!$B$16:$D$55,2)/1000)","v":0},null,null,null,{"$f":"IF(AND(H50 > 0, B50 > 0), LOOKUP(H50,INDEX(Faktoren!data,,1),INDEX(Faktoren!data,,5)),0)","v":0},0]
[null,null,"",null,{"$f":"Textes!A307","v":"4e abattage"},null,{"$f":"IF(D47-D48-D49-D50-D51>0,D47-D48-D49-D50-D51,0)","v":0},{"$f":"IF(AND(D51>0,B51>0),B51-B47+1,0)","v":0},{"$f":"IF(H51>0,IF(H51>Faktoren!$D$5,Faktoren!$E$4,Faktoren!$E$5),0)","v":0},{"$f":"IF(H51>0,D51*I51,0)","v":0},null,null,{"$f":"IF(OR(B51=\"\",D51=\"\"),0,H51+(I$6-B51))","v":0},{"$f":"IF(D51=\"\",0,VLOOKUP(M51,Faktoren!$B$16:$D$55,2)/1000)","v":0},null,null,null,{"$f":"IF(AND(H51 > 0, B51 > 0), LOOKUP(H51,INDEX(Faktoren!data,,1),INDEX(Faktoren!data,,5)),0)","v":0},0]
[null,null,"",null,{"$f":"Textes!A308","v":"5e abattage"},null,{"$f":"IF(D47-D48-D49-D50-D51-D52>0,D47-D48-D49-D50-D51-D52,0)","v":0},{"$f":"IF(AND(D52>0,B52>0),B52-B47+1,0)","v":0},{"$f":"IF(H52>0,IF(H52>Faktoren!$D$5,Faktoren!$E$4,Faktoren!$E$5),0)","v":0},{"$f":"IF(H52>0,D52*I52,0)","v":0},null,null,{"$f":"IF(OR(B52=\"\",D52=\"\"),0,H52+(I$6-B52))","v":0},{"$f":"IF(D52=\"\",0,VLOOKUP(M52,Faktoren!$B$16:$D$55,2)/1000)","v":0},null,null,null,{"$f":"IF(AND(H52 > 0, B52 > 0), LOOKUP(H52,INDEX(Faktoren!data,,1),INDEX(Faktoren!data,,5)),0)","v":0},0]
[null,{"$f":"IF(SUM(B47:B52) > 0,E53,\"\")","v":""},null,{"$f":"+D47-SUM(D48:D52)","v":0},{"$f":"Textes!A309","v":"pertes"},{"$f":"D53*0.6","v":0},null,null,{"$f":"IF(D53>0,Faktoren!$E$7,0)","v":0},{"$f":"IF(D53>0,D53*I53,0)","v":0},{"$f":"SUM(J48:J53)","v":0},null,{"$f":"IF(MAX(B47:B52)<$I$6,0,VLOOKUP($I$6,B47:G52,6))","v":0},null,{"$f":"MAX(B47:B52)","v":"00:00:00"},{"$f":"IF(OR($F$6=\"\",I$6=\"\",O53<F$6),99,IF(AND(O53>F$6,O53<=I$6),0,1))","v":99},null,{"$f":"IF(AND(H53 > 0, B53 > 0), LOOKUP(H53,INDEX(Faktoren!data,,1),INDEX(Faktoren!data,,5)),0)","v":0},0,{"$f":"SUM(S47:S53)","v":0}]
[null,null,null,{"$f":"IF(D47>0,ROUND(+D53/D47*100,1),0)","v":0},{"$f":"Textes!A310","v":"pertes en %"},null,"belegt",{"$f":"MAX(H47:H52)","v":0},{"$f":"Textes!A312","v":"jours poulailler occupé"},null,null,null,null,{"$f":"IF(P53=1,$I$6-B47+1,H54)","v":0}]
[null,null,null,{"$f":"IF(P53=99,0,IF(P53=0,H54/MAX(H48:H52),IF(P53=1,(H54-(O53-$I$6))/H54,0)))","v":0},{"$f":"Textes!A311","v":"Rotations"},null,null,{"$f":"IF(B57<>0,(B57-O53),0)","v":0},{"$f":"Textes!A313","v":"jours poulailler inoccupé"}]
[null,{"$f":"Textes!A295","v":"Rotation 5"}]
[null,null,{"$f":"IF(ISERROR(Jahr), \"\", IF($F$6>B57,\"\",IF(B57>$I$6,Jahr + 1,Jahr)))","v":""},null,{"$f":"Textes!A303","v":"Mise en poulailler"},{"$f":"D57*0.04","v":0},{"$f":"IF(D57>0,D57,0)","v":0},null,null,null,null,null,{"$f":"IF(OR(B57=\"\",D57=\"\"),0,IF((I$6-B57)=0,1,H57+(I$6-B57)))","v":0},{"$f":"IF(D57=\"\",0,VLOOKUP(M57,Faktoren!$B$16:$D$55,2)/1000)","v":0},null,null,null,{"$f":"IF(AND(H57 > 0, B57 > 0), LOOKUP(H57,INDEX(Faktoren!data,,1),INDEX(Faktoren!data,,5)),0)","v":0},{"$f":"D57:D63 * R57:R63","v":0}]
[null,null,"",null,{"$f":"Textes!A304","v":"1er abattage"},null,{"$f":"IF(D57-D58>0,D57-D58,0)","v":0},{"$f":"IF(AND(D58>0,B58>0),B58-B57+1,0)","v":0},{"$f":"IF(H58>0,IF(H58>Faktoren!$D$5,Faktoren!$E$4,Faktoren!$E$5),0)","v":0},{"$f":"IF(H58>0,D58*I58,0)","v":0},null,null,{"$f":"IF(OR(B58=\"\",D58=\"\"),0,H58+(I$6-B58))","v":0},{"$f":"IF(D58=\"\",0,VLOOKUP(M58,Faktoren!$B$16:$D$55,2)/1000)","v":0},null,null,null,{"$f":"IF(AND(H58 > 0, B58 > 0), LOOKUP(H58,INDEX(Faktoren!data,,1),INDEX(Faktoren!data,,5)),0)","v":0},0]
[null,null,"",null,{"$f":"Textes!A305","v":"2e abattage"},null,{"$f":"IF(D57-D58-D59>0,D57-D58-D59,0)","v":0},{"$f":"IF(AND(D59>0,B59>0),B59-B57+1,0)","v":0},{"$f":"IF(H59>0,IF(H59>Faktoren!$D$5,Faktoren!$E$4,Faktoren!$E$5),0)","v":0},{"$f":"IF(H59>0,D59*I59,0)","v":0},null,null,{"$f":"IF(OR(B59=\"\",D59=\"\"),0,H59+(I$6-B59))","v":0},{"$f":"IF(D59=\"\",0,VLOOKUP(M59,Faktoren!$B$16:$D$55,2)/1000)","v":0},null,null,null,{"$f":"IF(AND(H59 > 0, B59 > 0), LOOKUP(H59,INDEX(Faktoren!data,,1),INDEX(Faktoren!data,,5)),0)","v":0},0]
[null,null,"",null,{"$f":"Textes!A306","v":"3e abattage"},null,{"$f":"IF(D57-D58-D59-D60>0,D57-D58-D59-D60,0)","v":0},{"$f":"IF(AND(D60>0,B60>0),B60-B57+1,0)","v":0},{"$f":"IF(H60>0,IF(H60>Faktoren!$D$5,Faktoren!$E$4,Faktoren!$E$5),0)","v":0},{"$f":"IF(H60>0,D60*I60,0)","v":0},null,null,{"$f":"IF(OR(B60=\"\",D60=\"\"),0,H60+(I$6-B60))","v":0},{"$f":"IF(D60=\"\",0,VLOOKUP(M60,Faktoren!$B$16:$D$55,2)/1000)","v":0},null,null,null,{"$f":"IF(AND(H60 > 0, B60 > 0), LOOKUP(H60,INDEX(Faktoren!data,,1),INDEX(Faktoren!data,,5)),0)","v":0},0]
[null,null,"",null,{"$f":"Textes!A307","v":"4e abattage"},null,{"$f":"IF(D57-D58-D59-D60-D61>0,D57-D58-D59-D60-D61,0)","v":0},{"$f":"IF(AND(D61>0,B61>0),B61-B57+1,0)","v":0},{"$f":"IF(H61>0,IF(H61>Faktoren!$D$5,Faktoren!$E$4,Faktoren!$E$5),0)","v":0},{"$f":"IF(H61>0,D61*I61,0)","v":0},null,null,{"$f":"IF(OR(B61=\"\",D61=\"\"),0,H61+(I$6-B61))","v":0},{"$f":"IF(D61=\"\",0,VLOOKUP(M61,Faktoren!$B$16:$D$55,2)/1000)","v":0},null,null,null,{"$f":"IF(AND(H61 > 0, B61 > 0), LOOKUP(H61,INDEX(Faktoren!data,,1),INDEX(Faktoren!data,,5)),0)","v":0},0]
[null,null,"",null,{"$f":"Textes!A308","v":"5e abattage"},null,{"$f":"IF(D57-D58-D59-D60-D61-D62>0,D57-D58-D59-D60-D61-D62,0)","v":0},{"$f":"IF(AND(D62>0,B62>0),B62-B57+1,0)","v":0},{"$f":"IF(H62>0,IF(H62>Faktoren!$D$5,Faktoren!$E$4,Faktoren!$E$5),0)","v":0},{"$f":"IF(H62>0,D62*I62,0)","v":0},null,null,{"$f":"IF(OR(B62=\"\",D62=\"\"),0,H62+(I$6-B62))","v":0},{"$f":"IF(D62=\"\",0,VLOOKUP(M62,Faktoren!$B$16:$D$55,2)/1000)","v":0},null,null,null,{"$f":"IF(AND(H62 > 0, B62 > 0), LOOKUP(H62,INDEX(Faktoren!data,,1),INDEX(Faktoren!data,,5)),0)","v":0},0]
[null,{"$f":"IF(SUM(B57:B62) > 0,E63,\"\")","v":""},null,{"$f":"+D57-SUM(D58:D62)","v":0},{"$f":"Textes!A309","v":"pertes"},{"$f":"D63*0.6","v":0},null,null,{"$f":"IF(D63>0,Faktoren!$E$7,0)","v":0},{"$f":"IF(D63>0,D63*I63,0)","v":0},{"$f":"SUM(J58:J63)","v":0},null,{"$f":"IF(MAX(B57:B62)<$I$6,0,VLOOKUP($I$6,B57:G62,6))","v":0},null,{"$f":"MAX(B57:B62)","v":"00:00:00"},{"$f":"IF(OR($F$6=\"\",I$6=\"\",O63<F$6),99,IF(AND(O63>F$6,O63<=I$6),0,1))","v":99},null,{"$f":"IF(AND(H63 > 0, B63 > 0), LOOKUP(H63,INDEX(Faktoren!data,,1),INDEX(Faktoren!data,,5)),0)","v":0},0,{"$f":"SUM(S57:S63)","v":0}]
[null,null,null,{"$f":"IF(D57>0,ROUND(+D63/D57*100,1),0)","v":0},{"$f":"Textes!A310","v":"pertes en %"},null,"belegt",{"$f":"MAX(H57:H62)","v":0},{"$f":"Textes!A312","v":"jours poulailler occupé"},null,null,null,null,{"$f":"IF(P63=1,$I$6-B57+1,H64)","v":0}]
[null,null,null,{"$f":"IF(P63=99,0,IF(P63=0,H64/MAX(H58:H62),IF(P63=1,(H64-(O63-$I$6))/H64,0)))","v":0},{"$f":"Textes!A311","v":"Rotations"},null,null,{"$f":"IF(B69<>0,(B69-O63),0)","v":0},{"$f":"Textes!A313","v":"jours poulailler inoccupé"}]
[]
[null,{"$f":"Textes!A267","v":"Poulailler 1"},null,null,null,null,null,null,null,null,{"$f":"Textes!A338","v":"page 2"}]
[null,{"$f":"Textes!A296","v":"Rotation 6"}]
[null,null,{"$f":"IF(ISERROR(Jahr), \"\", IF($F$6>B69,\"\",IF(B69>$I$6,Jahr + 1,Jahr)))","v":""},null,{"$f":"Textes!A303","v":"Mise en poulailler"},{"$f":"D69*0.04","v":0},{"$f":"IF(D69>0,D69,0)","v":0},null,null,null,null,null,{"$f":"IF(OR(B69=\"\",D69=\"\"),0,IF((I$6-B69)=0,1,H69+(I$6-B69)))","v":0},{"$f":"IF(D69=\"\",0,VLOOKUP(M69,Faktoren!$B$16:$D$55,2)/1000)","v":0},null,null,null,{"$f":"IF(AND(H69 > 0, B69 > 0), LOOKUP(H69,INDEX(Faktoren!data,,1),INDEX(Faktoren!data,,5)),0)","v":0},{"$f":"D69:D75 * R69:R75","v":0}]
[null,null,"",null,{"$f":"Textes!A304","v":"1er abattage"},null,{"$f":"IF(D69-D70>0,D69-D70,0)","v":0},{"$f":"IF(AND(D70>0,B70>0),B70-B69+1,0)","v":0},{"$f":"IF(H70>0,IF(H70>Faktoren!$D$5,Faktoren!$E$4,Faktoren!$E$5),0)","v":0},{"$f":"IF(H70>0,D70*I70,0)","v":0},null,null,{"$f":"IF(OR(B70=\"\",D70=\"\"),0,H70+(I$6-B70))","v":0},{"$f":"IF(D70=\"\",0,VLOOKUP(M70,Faktoren!$B$16:$D$55,2)/1000)","v":0},null,null,null,{"$f":"IF(AND(H70 > 0, B70 > 0), LOOKUP(H70,INDEX(Faktoren!data,,1),INDEX(Faktoren!data,,5)),0)","v":0},0]
[null,null,"",null,{"$f":"Textes!A305","v":"2e abattage"},null,{"$f":"IF(D69-D70-D71>0,D69-D70-D71,0)","v":0},{"$f":"IF(AND(D71>0,B71>0),B71-B69+1,0)","v":0},{"$f":"IF(H71>0,IF(H71>Faktoren!$D$5,Faktoren!$E$4,Faktoren!$E$5),0)","v":0},{"$f":"IF(H71>0,D71*I71,0)","v":0},null,null,{"$f":"IF(OR(B71=\"\",D71=\"\"),0,H71+(I$6-B71))","v":0},{"$f":"IF(D71=\"\",0,VLOOKUP(M71,Faktoren!$B$16:$D$55,2)/1000)","v":0},null,null,null,{"$f":"IF(AND(H71 > 0, B71 > 0), LOOKUP(H71,INDEX(Faktoren!data,,1),INDEX(Faktoren!data,,5)),0)","v":0},0]
[null,null,"",null,{"$f":"Textes!A306","v":"3e abattage"},null,{"$f":"IF(D69-D70-D71-D72>0,D69-D70-D71-D72,0)","v":0},{"$f":"IF(AND(D72>0,B72>0),B72-B69+1,0)","v":0},{"$f":"IF(H72>0,IF(H72>Faktoren!$D$5,Faktoren!$E$4,Faktoren!$E$5),0)","v":0},{"$f":"IF(H72>0,D72*I72,0)","v":0},null,null,{"$f":"IF(OR(B72=\"\",D72=\"\"),0,H72+(I$6-B72))","v":0},{"$f":"IF(D72=\"\",0,VLOOKUP(M72,Faktoren!$B$16:$D$55,2)/1000)","v":0},null,null,null,{"$f":"IF(AND(H72 > 0, B72 > 0), LOOKUP(H72,INDEX(Faktoren!data,,1),INDEX(Faktoren!data,,5)),0)","v":0},0]
[null,null,"",null,{"$f":"Textes!A307","v":"4e abattage"},null,{"$f":"IF(D69-D70-D71-D72-D73>0,D69-D70-D71-D72-D73,0)","v":0},{"$f":"IF(AND(D73>0,B73>0),B73-B69+1,0)","v":0},{"$f":"IF(H73>0,IF(H73>Faktoren!$D$5,Faktoren!$E$4,Faktoren!$E$5),0)","v":0},{"$f":"IF(H73>0,D73*I73,0)","v":0},null,null,{"$f":"IF(OR(B73=\"\",D73=\"\"),0,H73+(I$6-B73))","v":0},{"$f":"IF(D73=\"\",0,VLOOKUP(M73,Faktoren!$B$16:$D$55,2)/1000)","v":0},null,null,null,{"$f":"IF(AND(H73 > 0, B73 > 0), LOOKUP(H73,INDEX(Faktoren!data,,1),INDEX(Faktoren!data,,5)),0)","v":0},0]
[null,null,"",null,{"$f":"Textes!A308","v":"5e abattage"},null,{"$f":"IF(D69-D70-D71-D72-D73-D74>0,D69-D70-D71-D72-D73-D74,0)","v":0},{"$f":"IF(AND(D74>0,B74>0),B74-B69+1,0)","v":0},{"$f":"IF(H74>0,IF(H74>Faktoren!$D$5,Faktoren!$E$4,Faktoren!$E$5),0)","v":0},{"$f":"IF(H74>0,D74*I74,0)","v":0},null,null,{"$f":"IF(OR(B74=\"\",D74=\"\"),0,H74+(I$6-B74))","v":0},{"$f":"IF(D74=\"\",0,VLOOKUP(M74,Faktoren!$B$16:$D$55,2)/1000)","v":0},null,null,null,{"$f":"IF(AND(H74 > 0, B74 > 0), LOOKUP(H74,INDEX(Faktoren!data,,1),INDEX(Faktoren!data,,5)),0)","v":0},0]
[null,{"$f":"IF(SUM(B69:B74) > 0,E75,\"\")","v":""},null,{"$f":"+D69-SUM(D70:D74)","v":0},{"$f":"Textes!A309","v":"pertes"},{"$f":"D75*0.6","v":0},null,null,{"$f":"IF(D75>0,Faktoren!$E$7,0)","v":0},{"$f":"IF(D75>0,D75*I75,0)","v":0},{"$f":"SUM(J70:J75)","v":0},null,{"$f":"IF(MAX(B69:B74)<$I$6,0,VLOOKUP($I$6,B69:G74,6))","v":0},null,{"$f":"MAX(B69:B74)","v":"00:00:00"},{"$f":"IF(OR($F$6=\"\",I$6=\"\",O75<F$6),99,IF(AND(O75>F$6,O75<=I$6),0,1))","v":99},null,{"$f":"IF(AND(H75 > 0, B75 > 0), LOOKUP(H75,INDEX(Faktoren!data,,1),INDEX(Faktoren!data,,5)),0)","v":0},0,{"$f":"SUM(S69:S75)","v":0}]
[null,null,null,{"$f":"IF(D69>0,ROUND(+D75/D69*100,1),0)","v":0},{"$f":"Textes!A310","v":"pertes en %"},null,"belegt",{"$f":"MAX(H69:H74)","v":0},{"$f":"Textes!A312","v":"jours poulailler occupé"},null,null,null,null,{"$f":"IF(P75=1,$I$6-B69+1,H76)","v":0}]
[null,null,null,{"$f":"IF(P75=99,0,IF(P75=0,H76/MAX(H70:H74),IF(P75=1,(H76-(O75-$I$6))/H76,0)))","v":0},{"$f":"Textes!A311","v":"Rotations"},null,null,{"$f":"IF(B79<>0,(B79-O75),0)","v":0},{"$f":"Textes!A313","v":"jours poulailler inoccupé"}]
[null,{"$f":"Textes!A297","v":"Rotation 7"}]
[null,null,{"$f":"IF(ISERROR(Jahr), \"\", IF($F$6>B79,\"\",IF(B79>$I$6,Jahr + 1,Jahr)))","v":""},null,{"$f":"Textes!A303","v":"Mise en poulailler"},{"$f":"D79*0.04","v":0},{"$f":"IF(D79>0,D79,0)","v":0},null,null,null,null,null,{"$f":"IF(OR(B79=\"\",D79=\"\"),0,IF((I$6-B79)=0,1,H79+(I$6-B79)))","v":0},{"$f":"IF(D79=\"\",0,VLOOKUP(M79,Faktoren!$B$16:$D$55,2)/1000)","v":0},null,null,null,{"$f":"IF(AND(H79 > 0, B79 > 0), LOOKUP(H79,INDEX(Faktoren!data,,1),INDEX(Faktoren!data,,5)),0)","v":0},{"$f":"D79:D85 * R79:R85","v":0}]
[null,null,"",null,{"$f":"Textes!A304","v":"1er abattage"},null,{"$f":"IF(D79-D80>0,D79-D80,0)","v":0},{"$f":"IF(AND(D80>0,B80>0),B80-B79+1,0)","v":0},{"$f":"IF(H80>0,IF(H80>Faktoren!$D$5,Faktoren!$E$4,Faktoren!$E$5),0)","v":0},{"$f":"IF(H80>0,D80*I80,0)","v":0},null,null,{"$f":"IF(OR(B80=\"\",D80=\"\"),0,H80+(I$6-B80))","v":0},{"$f":"IF(D80=\"\",0,VLOOKUP(M80,Faktoren!$B$16:$D$55,2)/1000)","v":0},null,null,null,{"$f":"IF(AND(H80 > 0, B80 > 0), LOOKUP(H80,INDEX(Faktoren!data,,1),INDEX(Faktoren!data,,5)),0)","v":0},0]
[null,null,"",null,{"$f":"Textes!A305","v":"2e abattage"},null,{"$f":"IF(D79-D80-D81>0,D79-D80-D81,0)","v":0},{"$f":"IF(AND(D81>0,B81>0),B81-B79+1,0)","v":0},{"$f":"IF(H81>0,IF(H81>Faktoren!$D$5,Faktoren!$E$4,Faktoren!$E$5),0)","v":0},{"$f":"IF(H81>0,D81*I81,0)","v":0},null,null,{"$f":"IF(OR(B81=\"\",D81=\"\"),0,H81+(I$6-B81))","v":0},{"$f":"IF(D81=\"\",0,VLOOKUP(M81,Faktoren!$B$16:$D$55,2)/1000)","v":0},null,null,null,{"$f":"IF(AND(H81 > 0, B81 > 0), LOOKUP(H81,INDEX(Faktoren!data,,1),INDEX(Faktoren!data,,5)),0)","v":0},0]
[null,null,"",null,{"$f":"Textes!A306","v":"3e abattage"},null,{"$f":"IF(D79-D80-D81-D82>0,D79-D80-D81-D82,0)","v":0},{"$f":"IF(AND(D82>0,B82>0),B82-B79+1,0)","v":0},{"$f":"IF(H82>0,IF(H82>Faktoren!$D$5,Faktoren!$E$4,Faktoren!$E$5),0)","v":0},{"$f":"IF(H82>0,D82*I82,0)","v":0},null,null,{"$f":"IF(OR(B82=\"\",D82=\"\"),0,H82+(I$6-B82))","v":0},{"$f":"IF(D82=\"\",0,VLOOKUP(M82,Faktoren!$B$16:$D$55,2)/1000)","v":0},null,null,null,{"$f":"IF(AND(H82 > 0, B82 > 0), LOOKUP(H82,INDEX(Faktoren!data,,1),INDEX(Faktoren!data,,5)),0)","v":0},0]
[null,null,"",null,{"$f":"Textes!A307","v":"4e abattage"},null,{"$f":"IF(D79-D80-D81-D82-D83>0,D79-D80-D81-D82-D83,0)","v":0},{"$f":"IF(AND(D83>0,B83>0),B83-B79+1,0)","v":0},{"$f":"IF(H83>0,IF(H83>Faktoren!$D$5,Faktoren!$E$4,Faktoren!$E$5),0)","v":0},{"$f":"IF(H83>0,D83*I83,0)","v":0},null,null,{"$f":"IF(OR(B83=\"\",D83=\"\"),0,H83+(I$6-B83))","v":0},{"$f":"IF(D83=\"\",0,VLOOKUP(M83,Faktoren!$B$16:$D$55,2)/1000)","v":0},null,null,null,{"$f":"IF(AND(H83 > 0, B83 > 0), LOOKUP(H83,INDEX(Faktoren!data,,1),INDEX(Faktoren!data,,5)),0)","v":0},0]
[null,null,"",null,{"$f":"Textes!A308","v":"5e abattage"},null,{"$f":"IF(D79-D80-D81-D82-D83-D84>0,D79-D80-D81-D82-D83-D84,0)","v":0},{"$f":"IF(AND(D84>0,B84>0),B84-B79+1,0)","v":0},{"$f":"IF(H84>0,IF(H84>Faktoren!$D$5,Faktoren!$E$4,Faktoren!$E$5),0)","v":0},{"$f":"IF(H84>0,D84*I84,0)","v":0},null,null,{"$f":"IF(OR(B84=\"\",D84=\"\"),0,H84+(I$6-B84))","v":0},{"$f":"IF(D84=\"\",0,VLOOKUP(M84,Faktoren!$B$16:$D$55,2)/1000)","v":0},null,null,null,{"$f":"IF(AND(H84 > 0, B84 > 0), LOOKUP(H84,INDEX(Faktoren!data,,1),INDEX(Faktoren!data,,5)),0)","v":0},0]
[null,{"$f":"IF(SUM(B79:B84) > 0,E85,\"\")","v":""},null,{"$f":"+D79-SUM(D80:D84)","v":0},{"$f":"Textes!A309","v":"pertes"},{"$f":"D85*0.6","v":0},null,null,{"$f":"IF(D85>0,Faktoren!$E$7,0)","v":0},{"$f":"IF(D85>0,D85*I85,0)","v":0},{"$f":"SUM(J80:J85)","v":0},null,{"$f":"IF(MAX(B79:B84)<$I$6,0,VLOOKUP($I$6,B79:G84,6))","v":0},null,{"$f":"MAX(B79:B84)","v":"00:00:00"},{"$f":"IF(OR($F$6=\"\",I$6=\"\",O85<F$6),99,IF(AND(O85>F$6,O85<=I$6),0,1))","v":99},null,{"$f":"IF(AND(H85 > 0, B85 > 0), LOOKUP(H85,INDEX(Faktoren!data,,1),INDEX(Faktoren!data,,5)),0)","v":0},0,{"$f":"SUM(S79:S85)","v":0}]
[null,null,null,{"$f":"IF(D79>0,ROUND(+D85/D79*100,1),0)","v":0},{"$f":"Textes!A310","v":"pertes en %"},null,"belegt",{"$f":"MAX(H79:H84)","v":0},{"$f":"Textes!A312","v":"jours poulailler occupé"},null,null,null,null,{"$f":"IF(P85=1,$I$6-B79+1,H86)","v":0}]
[null,null,null,{"$f":"IF(P85=99,0,IF(P85=0,H86/MAX(H80:H84),IF(P85=1,(H86-(O85-$I$6))/H86,0)))","v":0},{"$f":"Textes!A311","v":"Rotations"},null,null,{"$f":"IF(B89<>0,(B89-O85),0)","v":0},{"$f":"Textes!A313","v":"jours poulailler inoccupé"}]
[null,{"$f":"Textes!A298","v":"Rotation 8"}]
[null,null,{"$f":"IF(ISERROR(Jahr), \"\", IF($F$6>B89,\"\",IF(B89>$I$6,Jahr + 1,Jahr)))","v":""},null,{"$f":"Textes!A303","v":"Mise en poulailler"},{"$f":"D89*0.04","v":0},{"$f":"IF(D89>0,D89,0)","v":0},null,null,null,null,null,{"$f":"IF(OR(B89=\"\",D89=\"\"),0,IF((I$6-B89)=0,1,H89+(I$6-B89)))","v":0},{"$f":"IF(D89=\"\",0,VLOOKUP(M89,Faktoren!$B$16:$D$55,2)/1000)","v":0},null,null,null,{"$f":"IF(AND(H89 > 0, B89 > 0), LOOKUP(H89,INDEX(Faktoren!data,,1),INDEX(Faktoren!data,,5)),0)","v":0},{"$f":"D89:D95 * R89:R95","v":0}]
[null,null,"",null,{"$f":"Textes!A304","v":"1er abattage"},null,{"$f":"IF(D89-D90>0,D89-D90,0)","v":0},{"$f":"IF(AND(D90>0,B90>0),B90-B89+1,0)","v":0},{"$f":"IF(H90>0,IF(H90>Faktoren!$D$5,Faktoren!$E$4,Faktoren!$E$5),0)","v":0},{"$f":"IF(H90>0,D90*I90,0)","v":0},null,null,{"$f":"IF(OR(B90=\"\",D90=\"\"),0,H90+(I$6-B90))","v":0},{"$f":"IF(D90=\"\",0,VLOOKUP(M90,Faktoren!$B$16:$D$55,2)/1000)","v":0},null,null,null,{"$f":"IF(AND(H90 > 0, B90 > 0), LOOKUP(H90,INDEX(Faktoren!data,,1),INDEX(Faktoren!data,,5)),0)","v":0},0]
[null,null,"",null,{"$f":"Textes!A305","v":"2e abattage"},null,{"$f":"IF(D89-D90-D91>0,D89-D90-D91,0)","v":0},{"$f":"IF(AND(D91>0,B91>0),B91-B89+1,0)","v":0},{"$f":"IF(H91>0,IF(H91>Faktoren!$D$5,Faktoren!$E$4,Faktoren!$E$5),0)","v":0},{"$f":"IF(H91>0,D91*I91,0)","v":0},null,null,{"$f":"IF(OR(B91=\"\",D91=\"\"),0,H91+(I$6-B91))","v":0},{"$f":"IF(D91=\"\",0,VLOOKUP(M91,Faktoren!$B$16:$D$55,2)/1000)","v":0},null,null,null,{"$f":"IF(AND(H91 > 0, B91 > 0), LOOKUP(H91,INDEX(Faktoren!data,,1),INDEX(Faktoren!data,,5)),0)","v":0},0]
[null,null,"",null,{"$f":"Textes!A306","v":"3e abattage"},null,{"$f":"IF(D89-D90-D91-D92>0,D89-D90-D91-D92,0)","v":0},{"$f":"IF(AND(D92>0,B92>0),B92-B89+1,0)","v":0},{"$f":"IF(H92>0,IF(H92>Faktoren!$D$5,Faktoren!$E$4,Faktoren!$E$5),0)","v":0},{"$f":"IF(H92>0,D92*I92,0)","v":0},null,null,{"$f":"IF(OR(B92=\"\",D92=\"\"),0,H92+(I$6-B92))","v":0},{"$f":"IF(D92=\"\",0,VLOOKUP(M92,Faktoren!$B$16:$D$55,2)/1000)","v":0},null,null,null,{"$f":"IF(AND(H92 > 0, B92 > 0), LOOKUP(H92,INDEX(Faktoren!data,,1),INDEX(Faktoren!data,,5)),0)","v":0},0]
[null,null,"",null,{"$f":"Textes!A307","v":"4e abattage"},null,{"$f":"IF(D89-D90-D91-D92-D93>0,D89-D90-D91-D92-D93,0)","v":0},{"$f":"IF(AND(D93>0,B93>0),B93-B89+1,0)","v":0},{"$f":"IF(H93>0,IF(H93>Faktoren!$D$5,Faktoren!$E$4,Faktoren!$E$5),0)","v":0},{"$f":"IF(H93>0,D93*I93,0)","v":0},null,null,{"$f":"IF(OR(B93=\"\",D93=\"\"),0,H93+(I$6-B93))","v":0},{"$f":"IF(D93=\"\",0,VLOOKUP(M93,Faktoren!$B$16:$D$55,2)/1000)","v":0},null,null,null,{"$f":"IF(AND(H93 > 0, B93 > 0), LOOKUP(H93,INDEX(Faktoren!data,,1),INDEX(Faktoren!data,,5)),0)","v":0},0]
[null,null,"",null,{"$f":"Textes!A308","v":"5e abattage"},null,{"$f":"IF(D89-D90-D91-D92-D93-D94>0,D89-D90-D91-D92-D93-D94,0)","v":0},{"$f":"IF(AND(D94>0,B94>0),B94-B89+1,0)","v":0},{"$f":"IF(H94>0,IF(H94>Faktoren!$D$5,Faktoren!$E$4,Faktoren!$E$5),0)","v":0},{"$f":"IF(H94>0,D94*I94,0)","v":0},null,null,{"$f":"IF(OR(B94=\"\",D94=\"\"),0,H94+(I$6-B94))","v":0},{"$f":"IF(D94=\"\",0,VLOOKUP(M94,Faktoren!$B$16:$D$55,2)/1000)","v":0},null,null,null,{"$f":"IF(AND(H94 > 0, B94 > 0), LOOKUP(H94,INDEX(Faktoren!data,,1),INDEX(Faktoren!data,,5)),0)","v":0},0]
[null,{"$f":"IF(SUM(B89:B94) > 0,E95,\"\")","v":""},null,{"$f":"+D89-SUM(D90:D94)","v":0},{"$f":"Textes!A309","v":"pertes"},{"$f":"D95*0.6","v":0},null,null,{"$f":"IF(D95>0,Faktoren!$E$7,0)","v":0},{"$f":"IF(D95>0,D95*I95,0)","v":0},{"$f":"SUM(J90:J95)","v":0},null,{"$f":"IF(MAX(B89:B94)<$I$6,0,VLOOKUP($I$6,B89:G94,6))","v":0},null,{"$f":"MAX(B89:B94)","v":"00:00:00"},{"$f":"IF(OR($F$6=\"\",I$6=\"\",O95<F$6),99,IF(AND(O95>F$6,O95<=I$6),0,1))","v":99},null,{"$f":"IF(AND(H95 > 0, B95 > 0), LOOKUP(H95,INDEX(Faktoren!data,,1),INDEX(Faktoren!data,,5)),0)","v":0},0,{"$f":"SUM(S89:S95)","v":0}]
[null,null,null,{"$f":"IF(D89>0,ROUND(+D95/D89*100,1),0)","v":0},{"$f":"Textes!A310","v":"pertes en %"},null,"belegt",{"$f":"MAX(H89:H94)","v":0},{"$f":"Textes!A312","v":"jours poulailler occupé"},null,null,null,null,{"$f":"IF(P95=1,$I$6-B89+1,H96)","v":0}]
[null,null,null,{"$f":"IF(P95=99,0,IF(P95=0,H96/MAX(H90:H94),IF(P95=1,(H96-(O95-$I$6))/H96,0)))","v":0},{"$f":"Textes!A311","v":"Rotations"},null,null,{"$f":"IF(B99<>0,(B99-O95),0)","v":0},{"$f":"Textes!A313","v":"jours poulailler inoccupé"}]
[null,{"$f":"Textes!A299","v":"Rotation 9"}]
[null,null,{"$f":"IF(ISERROR(Jahr), \"\", IF($F$6>B99,\"\",IF(B99>$I$6,Jahr + 1,Jahr)))","v":""},null,{"$f":"Textes!A303","v":"Mise en poulailler"},{"$f":"D99*0.04","v":0},{"$f":"IF(D99>0,D99,0)","v":0},null,null,null,null,null,{"$f":"IF(OR(B99=\"\",D99=\"\"),0,IF((I$6-B99)=0,1,H99+(I$6-B99)))","v":0},{"$f":"IF(D99=\"\",0,VLOOKUP(M99,Faktoren!$B$16:$D$55,2)/1000)","v":0},null,null,null,{"$f":"IF(AND(H99 > 0, B99 > 0), LOOKUP(H99,INDEX(Faktoren!data,,1),INDEX(Faktoren!data,,5)),0)","v":0},{"$f":"D99:D105 * R99:R105","v":0}]
[null,null,"",null,{"$f":"Textes!A304","v":"1er abattage"},null,{"$f":"IF(D99-D100>0,D99-D100,0)","v":0},{"$f":"IF(AND(D100>0,B100>0),B100-B99+1,0)","v":0},{"$f":"IF(H100>0,IF(H100>Faktoren!$D$5,Faktoren!$E$4,Faktoren!$E$5),0)","v":0},{"$f":"IF(H100>0,D100*I100,0)","v":0},null,null,{"$f":"IF(OR(B100=\"\",D100=\"\"),0,H100+(I$6-B100))","v":0},{"$f":"IF(D100=\"\",0,VLOOKUP(M100,Faktoren!$B$16:$D$55,2)/1000)","v":0},null,null,null,{"$f":"IF(AND(H100 > 0, B100 > 0), LOOKUP(H100,INDEX(Faktoren!data,,1),INDEX(Faktoren!data,,5)),0)","v":0},0]
[null,null,"",null,{"$f":"Textes!A305","v":"2e abattage"},null,{"$f":"IF(D99-D100-D101>0,D99-D100-D101,0)","v":0},{"$f":"IF(AND(D101>0,B101>0),B101-B99+1,0)","v":0},{"$f":"IF(H101>0,IF(H101>Faktoren!$D$5,Faktoren!$E$4,Faktoren!$E$5),0)","v":0},{"$f":"IF(H101>0,D101*I101,0)","v":0},null,null,{"$f":"IF(OR(B101=\"\",D101=\"\"),0,H101+(I$6-B101))","v":0},{"$f":"IF(D101=\"\",0,VLOOKUP(M101,Faktoren!$B$16:$D$55,2)/1000)","v":0},null,null,null,{"$f":"IF(AND(H101 > 0, B101 > 0), LOOKUP(H101,INDEX(Faktoren!data,,1),INDEX(Faktoren!data,,5)),0)","v":0},0]
[null,null,"",null,{"$f":"Textes!A306","v":"3e abattage"},null,{"$f":"IF(D99-D100-D101-D102>0,D99-D100-D101-D102,0)","v":0},{"$f":"IF(AND(D102>0,B102>0),B102-B99+1,0)","v":0},{"$f":"IF(H102>0,IF(H102>Faktoren!$D$5,Faktoren!$E$4,Faktoren!$E$5),0)","v":0},{"$f":"IF(H102>0,D102*I102,0)","v":0},null,null,{"$f":"IF(OR(B102=\"\",D102=\"\"),0,H102+(I$6-B102))","v":0},{"$f":"IF(D102=\"\",0,VLOOKUP(M102,Faktoren!$B$16:$D$55,2)/1000)","v":0},null,null,null,{"$f":"IF(AND(H102 > 0, B102 > 0), LOOKUP(H102,INDEX(Faktoren!data,,1),INDEX(Faktoren!data,,5)),0)","v":0},0]
[null,null,"",null,{"$f":"Textes!A307","v":"4e abattage"},null,{"$f":"IF(D99-D100-D101-D102-D103>0,D99-D100-D101-D102-D103,0)","v":0},{"$f":"IF(AND(D103>0,B103>0),B103-B99+1,0)","v":0},{"$f":"IF(H103>0,IF(H103>Faktoren!$D$5,Faktoren!$E$4,Faktoren!$E$5),0)","v":0},{"$f":"IF(H103>0,D103*I103,0)","v":0},null,null,{"$f":"IF(OR(B103=\"\",D103=\"\"),0,H103+(I$6-B103))","v":0},{"$f":"IF(D103=\"\",0,VLOOKUP(M103,Faktoren!$B$16:$D$55,2)/1000)","v":0},null,null,null,{"$f":"IF(AND(H103 > 0, B103 > 0), LOOKUP(H103,INDEX(Faktoren!data,,1),INDEX(Faktoren!data,,5)),0)","v":0},0]
[null,null,"",null,{"$f":"Textes!A308","v":"5e abattage"},null,{"$f":"IF(D99-D100-D101-D102-D103-D104>0,D99-D100-D101-D102-D103-D104,0)","v":0},{"$f":"IF(AND(D104>0,B104>0),B104-B99+1,0)","v":0},{"$f":"IF(H104>0,IF(H104>Faktoren!$D$5,Faktoren!$E$4,Faktoren!$E$5),0)","v":0},{"$f":"IF(H104>0,D104*I104,0)","v":0},null,null,{"$f":"IF(OR(B104=\"\",D104=\"\"),0,H104+(I$6-B104))","v":0},{"$f":"IF(D104=\"\",0,VLOOKUP(M104,Faktoren!$B$16:$D$55,2)/1000)","v":0},null,null,null,{"$f":"IF(AND(H104 > 0, B104 > 0), LOOKUP(H104,INDEX(Faktoren!data,,1),INDEX(Faktoren!data,,5)),0)","v":0},0]
[null,{"$f":"IF(SUM(B99:B104) > 0,E105,\"\")","v":""},null,{"$f":"+D99-SUM(D100:D104)","v":0},{"$f":"Textes!A309","v":"pertes"},{"$f":"D105*0.6","v":0},null,null,{"$f":"IF(D105>0,Faktoren!$E$7,0)","v":0},{"$f":"IF(D105>0,D105*I105,0)","v":0},{"$f":"SUM(J100:J105)","v":0},null,{"$f":"IF(MAX(B99:B104)<$I$6,0,VLOOKUP($I$6,B99:G104,6))","v":0},null,{"$f":"MAX(B99:B104)","v":"00:00:00"},{"$f":"IF(OR($F$6=\"\",I$6=\"\",O105<F$6),99,IF(AND(O105>F$6,O105<=I$6),0,1))","v":99},null,{"$f":"IF(AND(H105 > 0, B105 > 0), LOOKUP(H105,INDEX(Faktoren!data,,1),INDEX(Faktoren!data,,5)),0)","v":0},0,{"$f":"SUM(S99:S105)","v":0}]
[null,null,null,{"$f":"IF(D99>0,ROUND(+D105/D99*100,1),0)","v":0},{"$f":"Textes!A310","v":"pertes en %"},null,"belegt",{"$f":"MAX(H99:H104)","v":0},{"$f":"Textes!A312","v":"jours poulailler occupé"},null,null,null,null,{"$f":"IF(P105=1,$I$6-B99+1,H106)","v":0}]
[null,null,null,{"$f":"IF(P105=99,0,IF(P105=0,H106/MAX(H100:H104),IF(P105=1,(H106-(O105-$I$6))/H106,0)))","v":0},{"$f":"Textes!A311","v":"Rotations"},null,null,{"$f":"IF(B109<>0,(B109-O105),0)","v":0},{"$f":"Textes!A313","v":"jours poulailler inoccupé"}]
[null,{"$f":"Textes!A300","v":"Rotation 10"}]
[null,null,{"$f":"IF(ISERROR(Jahr), \"\", IF($F$6>B109,\"\",IF(B109>$I$6,Jahr + 1,Jahr)))","v":""},null,{"$f":"Textes!A303","v":"Mise en poulailler"},{"$f":"D109*0.04","v":0},{"$f":"IF(D109>0,D109,0)","v":0},null,null,null,null,null,{"$f":"IF(OR(B109=\"\",D109=\"\"),0,IF((I$6-B109)=0,1,H109+(I$6-B109)))","v":0},{"$f":"IF(D109=\"\",0,VLOOKUP(M109,Faktoren!$B$16:$D$55,2)/1000)","v":0},null,null,null,{"$f":"IF(AND(H109 > 0, B109 > 0), LOOKUP(H109,INDEX(Faktoren!data,,1),INDEX(Faktoren!data,,5)),0)","v":0},{"$f":"D109:D115 * R109:R115","v":0}]
[null,null,"",null,{"$f":"Textes!A304","v":"1er abattage"},null,{"$f":"IF(D109-D110>0,D109-D110,0)","v":0},{"$f":"IF(AND(D110>0,B110>0),B110-B109+1,0)","v":0},{"$f":"IF(H110>0,IF(H110>Faktoren!$D$5,Faktoren!$E$4,Faktoren!$E$5),0)","v":0},{"$f":"IF(H110>0,D110*I110,0)","v":0},null,null,{"$f":"IF(OR(B110=\"\",D110=\"\"),0,H110+(I$6-B110))","v":0},{"$f":"IF(D110=\"\",0,VLOOKUP(M110,Faktoren!$B$16:$D$55,2)/1000)","v":0},null,null,null,{"$f":"IF(AND(H110 > 0, B110 > 0), LOOKUP(H110,INDEX(Faktoren!data,,1),INDEX(Faktoren!data,,5)),0)","v":0},0]
[null,null,"",null,{"$f":"Textes!A305","v":"2e abattage"},null,{"$f":"IF(D109-D110-D111>0,D109-D110-D111,0)","v":0},{"$f":"IF(AND(D111>0,B111>0),B111-B109+1,0)","v":0},{"$f":"IF(H111>0,IF(H111>Faktoren!$D$5,Faktoren!$E$4,Faktoren!$E$5),0)","v":0},{"$f":"IF(H111>0,D111*I111,0)","v":0},null,null,{"$f":"IF(OR(B111=\"\",D111=\"\"),0,H111+(I$6-B111))","v":0},{"$f":"IF(D111=\"\",0,VLOOKUP(M111,Faktoren!$B$16:$D$55,2)/1000)","v":0},null,null,null,{"$f":"IF(AND(H111 > 0, B111 > 0), LOOKUP(H111,INDEX(Faktoren!data,,1),INDEX(Faktoren!data,,5)),0)","v":0},0]
[null,null,"",null,{"$f":"Textes!A306","v":"3e abattage"},null,{"$f":"IF(D109-D110-D111-D112>0,D109-D110-D111-D112,0)","v":0},{"$f":"IF(AND(D112>0,B112>0),B112-B109+1,0)","v":0},{"$f":"IF(H112>0,IF(H112>Faktoren!$D$5,Faktoren!$E$4,Faktoren!$E$5),0)","v":0},{"$f":"IF(H112>0,D112*I112,0)","v":0},null,null,{"$f":"IF(OR(B112=\"\",D112=\"\"),0,H112+(I$6-B112))","v":0},{"$f":"IF(D112=\"\",0,VLOOKUP(M112,Faktoren!$B$16:$D$55,2)/1000)","v":0},null,null,null,{"$f":"IF(AND(H112 > 0, B112 > 0), LOOKUP(H112,INDEX(Faktoren!data,,1),INDEX(Faktoren!data,,5)),0)","v":0},0]
[null,null,"",null,{"$f":"Textes!A307","v":"4e abattage"},null,{"$f":"IF(D109-D110-D111-D112-D113>0,D109-D110-D111-D112-D113,0)","v":0},{"$f":"IF(AND(D113>0,B113>0),B113-B109+1,0)","v":0},{"$f":"IF(H113>0,IF(H113>Faktoren!$D$5,Faktoren!$E$4,Faktoren!$E$5),0)","v":0},{"$f":"IF(H113>0,D113*I113,0)","v":0},null,null,{"$f":"IF(OR(B113=\"\",D113=\"\"),0,H113+(I$6-B113))","v":0},{"$f":"IF(D113=\"\",0,VLOOKUP(M113,Faktoren!$B$16:$D$55,2)/1000)","v":0},null,null,null,{"$f":"IF(AND(H113 > 0, B113 > 0), LOOKUP(H113,INDEX(Faktoren!data,,1),INDEX(Faktoren!data,,5)),0)","v":0},0]
[null,null,"",null,{"$f":"Textes!A308","v":"5e abattage"},null,{"$f":"IF(D109-D110-D111-D112-D113-D114>0,D109-D110-D111-D112-D113-D114,0)","v":0},{"$f":"IF(AND(D114>0,B114>0),B114-B109+1,0)","v":0},{"$f":"IF(H114>0,IF(H114>Faktoren!$D$5,Faktoren!$E$4,Faktoren!$E$5),0)","v":0},{"$f":"IF(H114>0,D114*I114,0)","v":0},null,null,{"$f":"IF(OR(B114=\"\",D114=\"\"),0,H114+(I$6-B114))","v":0},{"$f":"IF(D114=\"\",0,VLOOKUP(M114,Faktoren!$B$16:$D$55,2)/1000)","v":0},null,null,null,{"$f":"IF(AND(H114 > 0, B114 > 0), LOOKUP(H114,INDEX(Faktoren!data,,1),INDEX(Faktoren!data,,5)),0)","v":0},0]
[null,{"$f":"IF(SUM(B109:B114) > 0,E115,\"\")","v":""},null,{"$f":"+D109-SUM(D110:D114)","v":0},{"$f":"Textes!A309","v":"pertes"},{"$f":"D115*0.6","v":0},null,null,{"$f":"IF(D115>0,Faktoren!$E$7,0)","v":0},{"$f":"IF(D115>0,D115*I115,0)","v":0},{"$f":"SUM(J110:J115)","v":0},null,{"$f":"IF(MAX(B109:B114)<$I$6,0,VLOOKUP($I$6,B109:G114,6))","v":0},null,{"$f":"MAX(B109:B114)","v":"00:00:00"},{"$f":"IF(OR($F$6=\"\",I$6=\"\",O115<F$6),99,IF(AND(O115>F$6,O115<=I$6),0,1))","v":99},null,{"$f":"IF(AND(H115 > 0, B115 > 0), LOOKUP(H115,INDEX(Faktoren!data,,1),INDEX(Faktoren!data,,5)),0)","v":0},0,{"$f":"SUM(S109:S115)","v":0}]
[null,null,null,{"$f":"IF(D109>0,ROUND(+D115/D109*100,1),0)","v":0},{"$f":"Textes!A310","v":"pertes en %"},null,"belegt",{"$f":"MAX(H109:H114)","v":0},{"$f":"Textes!A312","v":"jours poulailler occupé"},null,null,null,null,{"$f":"IF(P115=1,$I$6-B109+1,H116)","v":0}]
[null,null,null,{"$f":"IF(P115=99,0,IF(P115=0,H116/MAX(H110:H114),IF(P115=1,(H116-(O115-$I$6))/H116,0)))","v":0},{"$f":"Textes!A311","v":"Rotations"},null,null,{"$f":"IF(B119<>0,(B119-O115),0)","v":0},{"$f":"Textes!A313","v":"jours poulailler inoccupé"}]
[null,{"$f":"Textes!A301","v":"Rotation 11"}]
[null,null,{"$f":"IF(ISERROR(Jahr), \"\", IF($F$6>B119,\"\",IF(B119>$I$6,Jahr + 1,Jahr)))","v":""},null,{"$f":"Textes!A303","v":"Mise en poulailler"},{"$f":"D119*0.04","v":0},{"$f":"IF(D119>0,D119,0)","v":0},null,null,null,null,null,{"$f":"IF(OR(B119=\"\",D119=\"\"),0,IF((I$6-B119)=0,1,H119+(I$6-B119)))","v":0},{"$f":"IF(D119=\"\",0,VLOOKUP(M119,Faktoren!$B$16:$D$55,2)/1000)","v":0},null,null,null,{"$f":"IF(AND(H119 > 0, B119 > 0), LOOKUP(H119,INDEX(Faktoren!data,,1),INDEX(Faktoren!data,,5)),0)","v":0},{"$f":"D119:D125 * R119:R125","v":0}]
[null,null,"",null,{"$f":"Textes!A304","v":"1er abattage"},null,{"$f":"IF(D119-D120>0,D119-D120,0)","v":0},{"$f":"IF(AND(D120>0,B120>0),B120-B119+1,0)","v":0},{"$f":"IF(H120>0,IF(H120>Faktoren!$D$5,Faktoren!$E$4,Faktoren!$E$5),0)","v":0},{"$f":"IF(H120>0,D120*I120,0)","v":0},null,null,{"$f":"IF(OR(B120=\"\",D120=\"\"),0,H120+(I$6-B120))","v":0},{"$f":"IF(D120=\"\",0,VLOOKUP(M120,Faktoren!$B$16:$D$55,2)/1000)","v":0},null,null,null,{"$f":"IF(AND(H120 > 0, B120 > 0), LOOKUP(H120,INDEX(Faktoren!data,,1),INDEX(Faktoren!data,,5)),0)","v":0},0]
[null,null,"",null,{"$f":"Textes!A305","v":"2e abattage"},null,{"$f":"IF(D119-D120-D121>0,D119-D120-D121,0)","v":0},{"$f":"IF(AND(D121>0,B121>0),B121-B119+1,0)","v":0},{"$f":"IF(H121>0,IF(H121>Faktoren!$D$5,Faktoren!$E$4,Faktoren!$E$5),0)","v":0},{"$f":"IF(H121>0,D121*I121,0)","v":0},null,null,{"$f":"IF(OR(B121=\"\",D121=\"\"),0,H121+(I$6-B121))","v":0},{"$f":"IF(D121=\"\",0,VLOOKUP(M121,Faktoren!$B$16:$D$55,2)/1000)","v":0},null,null,null,{"$f":"IF(AND(H121 > 0, B121 > 0), LOOKUP(H121,INDEX(Faktoren!data,,1),INDEX(Faktoren!data,,5)),0)","v":0},0]
[null,null,"",null,{"$f":"Textes!A306","v":"3e abattage"},null,{"$f":"IF(D119-D120-D121-D122>0,D119-D120-D121-D122,0)","v":0},{"$f":"IF(AND(D122>0,B122>0),B122-B119+1,0)","v":0},{"$f":"IF(H122>0,IF(H122>Faktoren!$D$5,Faktoren!$E$4,Faktoren!$E$5),0)","v":0},{"$f":"IF(H122>0,D122*I122,0)","v":0},null,null,{"$f":"IF(OR(B122=\"\",D122=\"\"),0,H122+(I$6-B122))","v":0},{"$f":"IF(D122=\"\",0,VLOOKUP(M122,Faktoren!$B$16:$D$55,2)/1000)","v":0},null,null,null,{"$f":"IF(AND(H122 > 0, B122 > 0), LOOKUP(H122,INDEX(Faktoren!data,,1),INDEX(Faktoren!data,,5)),0)","v":0},0]
[null,null,"",null,{"$f":"Textes!A307","v":"4e abattage"},null,{"$f":"IF(D119-D120-D121-D122-D123>0,D119-D120-D121-D122-D123,0)","v":0},{"$f":"IF(AND(D123>0,B123>0),B123-B119+1,0)","v":0},{"$f":"IF(H123>0,IF(H123>Faktoren!$D$5,Faktoren!$E$4,Faktoren!$E$5),0)","v":0},{"$f":"IF(H123>0,D123*I123,0)","v":0},null,null,{"$f":"IF(OR(B123=\"\",D123=\"\"),0,H123+(I$6-B123))","v":0},{"$f":"IF(D123=\"\",0,VLOOKUP(M123,Faktoren!$B$16:$D$55,2)/1000)","v":0},null,null,null,{"$f":"IF(AND(H123 > 0, B123 > 0), LOOKUP(H123,INDEX(Faktoren!data,,1),INDEX(Faktoren!data,,5)),0)","v":0},0]
[null,null,"",null,{"$f":"Textes!A308","v":"5e abattage"},null,{"$f":"IF(D119-D120-D121-D122-D123-D124>0,D119-D120-D121-D122-D123-D124,0)","v":0},{"$f":"IF(AND(D124>0,B124>0),B124-B119+1,0)","v":0},{"$f":"IF(H124>0,IF(H124>Faktoren!$D$5,Faktoren!$E$4,Faktoren!$E$5),0)","v":0},{"$f":"IF(H124>0,D124*I124,0)","v":0},null,null,{"$f":"IF(OR(B124=\"\",D124=\"\"),0,H124+(I$6-B124))","v":0},{"$f":"IF(D124=\"\",0,VLOOKUP(M124,Faktoren!$B$16:$D$55,2)/1000)","v":0},null,null,null,{"$f":"IF(AND(H124 > 0, B124 > 0), LOOKUP(H124,INDEX(Faktoren!data,,1),INDEX(Faktoren!data,,5)),0)","v":0},0]
[null,{"$f":"IF(SUM(B119:B124) > 0,E125,\"\")","v":""},null,{"$f":"+D119-SUM(D120:D124)","v":0},{"$f":"Textes!A309","v":"pertes"},{"$f":"D125*0.6","v":0},null,null,{"$f":"IF(D125>0,Faktoren!$E$7,0)","v":0},{"$f":"IF(D125>0,D125*I125,0)","v":0},{"$f":"SUM(J120:J125)","v":0},null,{"$f":"IF(MAX(B119:B124)<$I$6,0,VLOOKUP($I$6,B119:G124,6))","v":0},null,{"$f":"MAX(B119:B124)","v":"00:00:00"},{"$f":"IF(OR($F$6=\"\",I$6=\"\",O125<F$6),99,IF(AND(O125>F$6,O125<=I$6),0,1))","v":99},null,{"$f":"IF(AND(H125 > 0, B125 > 0), LOOKUP(H125,INDEX(Faktoren!data,,1),INDEX(Faktoren!data,,5)),0)","v":0},0,{"$f":"SUM(S119:S125)","v":0}]
[null,null,null,{"$f":"IF(D119>0,ROUND(+D125/D119*100,1),0)","v":0},{"$f":"Textes!A310","v":"pertes en %"},null,"belegt",{"$f":"MAX(H119:H124)","v":0},{"$f":"Textes!A312","v":"jours poulailler occupé"},null,null,null,null,{"$f":"IF(P125=1,$I$6-B119+1,H126)","v":0}]
[null,null,null,{"$f":"IF(P125=99,0,IF(P125=0,H126/MAX(H120:H124),IF(P125=1,(H126-(O125-$I$6))/H126,0)))","v":0},{"$f":"Textes!A311","v":"Rotations"},null,null,{"$f":"IF(B131<>0,(B131-O125),0)","v":0},{"$f":"Textes!A313","v":"jours poulailler inoccupé"}]
[]
[null,{"$f":"Textes!A267","v":"Poulailler 1"},null,null,null,null,null,null,null,null,{"$f":"Textes!A339","v":"page 3"}]
[null,{"$f":"Textes!A302","v":"Rotation 12"}]
[null,null,{"$f":"IF(ISERROR(Jahr), \"\", IF($F$6>B131,\"\",IF(B131>$I$6,Jahr + 1,Jahr)))","v":""},null,{"$f":"Textes!A303","v":"Mise en poulailler"},{"$f":"D131*0.04","v":0},{"$f":"IF(D131>0,D131,0)","v":0},null,null,null,null,null,{"$f":"IF(OR(B131=\"\",D131=\"\"),0,IF((I$6-B131)=0,1,H131+(I$6-B131)))","v":0},{"$f":"IF(D131=\"\",0,VLOOKUP(M131,Faktoren!$B$16:$D$55,2)/1000)","v":0},null,null,null,{"$f":"IF(AND(H131 > 0, B131 > 0), LOOKUP(H131,INDEX(Faktoren!data,,1),INDEX(Faktoren!data,,5)),0)","v":0},{"$f":"D131:D137 * R131:R137","v":0}]
[null,null,"",null,{"$f":"Textes!A304","v":"1er abattage"},null,{"$f":"IF(D131-D132>0,D131-D132,0)","v":0},{"$f":"IF(AND(D132>0,B132>0),B132-B131+1,0)","v":0},{"$f":"IF(H132>0,IF(H132>Faktoren!$D$5,Faktoren!$E$4,Faktoren!$E$5),0)","v":0},{"$f":"IF(H132>0,D132*I132,0)","v":0},null,null,{"$f":"IF(OR(B132=\"\",D132=\"\"),0,H132+(I$6-B132))","v":0},{"$f":"IF(D132=\"\",0,VLOOKUP(M132,Faktoren!$B$16:$D$55,2)/1000)","v":0},null,null,null,{"$f":"IF(AND(H132 > 0, B132 > 0), LOOKUP(H132,INDEX(Faktoren!data,,1),INDEX(Faktoren!data,,5)),0)","v":0},0]
[null,null,"",null,{"$f":"Textes!A305","v":"2e abattage"},null,{"$f":"IF(D131-D132-D133>0,D131-D132-D133,0)","v":0},{"$f":"IF(AND(D133>0,B133>0),B133-B131+1,0)","v":0},{"$f":"IF(H133>0,IF(H133>Faktoren!$D$5,Faktoren!$E$4,Faktoren!$E$5),0)","v":0},{"$f":"IF(H133>0,D133*I133,0)","v":0},null,null,{"$f":"IF(OR(B133=\"\",D133=\"\"),0,H133+(I$6-B133))","v":0},{"$f":"IF(D133=\"\",0,VLOOKUP(M133,Faktoren!$B$16:$D$55,2)/1000)","v":0},null,null,null,{"$f":"IF(AND(H133 > 0, B133 > 0), LOOKUP(H133,INDEX(Faktoren!data,,1),INDEX(Faktoren!data,,5)),0)","v":0},0]
[null,null,"",null,{"$f":"Textes!A306","v":"3e abattage"},null,{"$f":"IF(D131-D132-D133-D134>0,D131-D132-D133-D134,0)","v":0},{"$f":"IF(AND(D134>0,B134>0),B134-B131+1,0)","v":0},{"$f":"IF(H134>0,IF(H134>Faktoren!$D$5,Faktoren!$E$4,Faktoren!$E$5),0)","v":0},{"$f":"IF(H134>0,D134*I134,0)","v":0},null,null,{"$f":"IF(OR(B134=\"\",D134=\"\"),0,H134+(I$6-B134))","v":0},{"$f":"IF(D134=\"\",0,VLOOKUP(M134,Faktoren!$B$16:$D$55,2)/1000)","v":0},null,null,null,{"$f":"IF(AND(H134 > 0, B134 > 0), LOOKUP(H134,INDEX(Faktoren!data,,1),INDEX(Faktoren!data,,5)),0)","v":0},0]
[null,null,"",null,{"$f":"Textes!A307","v":"4e abattage"},null,{"$f":"IF(D131-D132-D133-D134-D135>0,D131-D132-D133-D134-D135,0)","v":0},{"$f":"IF(AND(D135>0,B135>0),B135-B131+1,0)","v":0},{"$f":"IF(H135>0,IF(H135>Faktoren!$D$5,Faktoren!$E$4,Faktoren!$E$5),0)","v":0},{"$f":"IF(H135>0,D135*I135,0)","v":0},null,null,{"$f":"IF(OR(B135=\"\",D135=\"\"),0,H135+(I$6-B135))","v":0},{"$f":"IF(D135=\"\",0,VLOOKUP(M135,Faktoren!$B$16:$D$55,2)/1000)","v":0},null,null,null,{"$f":"IF(AND(H135 > 0, B135 > 0), LOOKUP(H135,INDEX(Faktoren!data,,1),INDEX(Faktoren!data,,5)),0)","v":0},0]
[null,null,"",null,{"$f":"Textes!A308","v":"5e abattage"},null,{"$f":"IF(D131-D132-D133-D134-D135-D136>0,D131-D132-D133-D134-D135-D136,0)","v":0},{"$f":"IF(AND(D136>0,B136>0),B136-B131+1,0)","v":0},{"$f":"IF(H136>0,IF(H136>Faktoren!$D$5,Faktoren!$E$4,Faktoren!$E$5),0)","v":0},{"$f":"IF(H136>0,D136*I136,0)","v":0},null,null,{"$f":"IF(OR(B136=\"\",D136=\"\"),0,H136+(I$6-B136))","v":0},{"$f":"IF(D136=\"\",0,VLOOKUP(M136,Faktoren!$B$16:$D$55,2)/1000)","v":0},null,null,null,{"$f":"IF(AND(H136 > 0, B136 > 0), LOOKUP(H136,INDEX(Faktoren!data,,1),INDEX(Faktoren!data,,5)),0)","v":0},0]
[null,{"$f":"IF(SUM(B131:B136) > 0,E137,\"\")","v":""},{"$f":"Jahr+1","v":{"$error":"#VALUE!"}},{"$f":"+D131-D132-D133-D136","v":0},{"$f":"Textes!A309","v":"pertes"},{"$f":"D137*0.6","v":0},null,null,{"$f":"IF(D137>0,Faktoren!$E$7,0)","v":0},{"$f":"IF(D137>0,D137*I137,0)","v":0},{"$f":"SUM(J132:J137)","v":0},null,{"$f":"IF(MAX(B131:B136)<$I$6,0,VLOOKUP($I$6,B131:G136,6))","v":0},null,{"$f":"MAX(B131:B136)","v":"00:00:00"},{"$f":"IF(OR($F$6=\"\",I$6=\"\",O137<F$6),99,IF(AND(O137>F$6,O137<=I$6),0,1))","v":99},null,{"$f":"IF(AND(H137 > 0, B137 > 0), LOOKUP(H137,INDEX(Faktoren!data,,1),INDEX(Faktoren!data,,5)),0)","v":0},0,{"$f":"SUM(S131:S137)","v":0}]
[null,null,null,{"$f":"IF(D131>0,ROUND(+D137/D131*100,1),0)","v":0},{"$f":"Textes!A310","v":"pertes en %"},null,"belegt",{"$f":"MAX(H131:H136)","v":0},{"$f":"Textes!A312","v":"jours poulailler occupé"},null,null,null,null,{"$f":"IF(P137=1,$I$6-B131+1,H138)","v":0}]
[null,null,null,{"$f":"IF(P137=99,0,IF(P137=0,H138/MAX(H132:H136),IF(P137=1,(H138-(O137-$I$6))/H138,0)))","v":0},{"$f":"Textes!A311","v":"Rotations"}]
[]
[null,{"$f":"Textes!A314","v":"Effectif moyen"},null,null,null,null,null,null,null,null,null,null,null,null,null,null,null,{"$f":"B141","v":"Effectif moyen"}]
[null,{"$f":"Textes!A315","v":"en nombre déterminant"},null,null,null,null,null,null,null,null,{"$f":"IF((K137+K125+K115+K105+K95+K85+K75+K63+K53+K43+K33+K23)>0,(K137+K125+K115+K105+K95+K85+K75+K63+K53+K43+K33+K23)/SUM($G$144:$G$155),0)","v":0},null,null,null,null,null,null,{"$f":" Textes!A316","v":"en unités de la période"},null,{"$f":"IF((T137+T125+T115+T105+T95+T85+T75+T63+T53+T43+T33+T23)>0,(T137+T125+T115+T105+T95+T85+T75+T63+T53+T43+T33+T23)/SUM($G$144:$G$155),0)","v":0}]
[]
[null,"Berechnung der Anzahl Umtriebe",null,null,null,null,{"$f":"IF(AND(K23>0,K33>0,K43>0,K53>0,K63>0,K75>0,K85>0,K95>0,K105>0,K115>0,K125>0,K137>0),12,0)","v":0}]
[null,null,null,null,null,null,{"$f":"IF(AND(K23>0,K33>0,K43>0,K53>0,K63>0,K75>0,K85>0,K95>0,K105>0,K115>0,K125>0,K137=0),11,0)","v":0}]
[null,null,null,null,null,null,{"$f":"IF(AND(K23>0,K33>0,K43>0,K53>0,K63>0,K75>0,K85>0,K95>0,K105>0,K115>0,K125=0,K137=0),10,0)","v":0}]
[null,null,null,null,null,null,{"$f":"IF(AND(K23>0,K33>0,K43>0,K53>0,K63>0,K75>0,K85>0,K95>0,K105>0,K115=0,K125=0,K137=0),9,0)","v":0}]
[null,null,null,null,null,null,{"$f":"IF(AND(K23>0,K33>0,K43>0,K53>0,K63>0,K75>0,K85>0,K95>0,K105=0,K115=0,K125=0,K137=0),8,0)","v":0}]
[null,null,null,null,null,null,{"$f":"IF(AND(K23>0,K33>0,K43>0,K53>0,K63>0,K75>0,K85>0,K95=0,K105=0,K115=0,K125=0,K137=0),7,0)","v":0}]
[null,null,null,null,null,null,{"$f":"IF(AND(K23>0,K33>0,K43>0,K53>0,K63>0,K75>0,K85=0,K95=0,K105=0,K115=0,K125=0,K137=0),6,0)","v":0}]
[null,null,null,null,null,null,{"$f":"IF(AND(K23>0,K33>0,K43>0,K53>0,K63>0,K75=0,K85=0,K95=0,K105=0,K115=0,K125=0,K137=0),5,0)","v":0}]
[null,null,null,null,null,null,{"$f":"IF(AND(K23>0,K33>0,K43>0,K53>0,K63=0,K75=0,K85=0,K95=0,K105=0,K115=0,K125=0,K137=0),4,0)","v":0}]
[null,null,null,null,null,null,{"$f":"IF(AND(K23>0,K33>0,K43>0,K53=0,K63=0,K75=0,K85=0,K95=0,K105=0,K115=0,K125=0,K137=0),3,0)","v":0}]
[null,null,null,null,null,null,{"$f":"IF(AND(K23>0,K33>0,K43=0,K53=0,K63=0,K75=0,K85=0,K95=0,K105=0,K115=0,K125=0,K137=0),2,0)","v":0}]
[null,null,null,null,null,null,{"$f":"IF(AND(K23>0,K33=0,K43=0,K53=0,K63=0,K75=0,K85=0,K95=0,K105=0,K115=0,K125=0,K137=0),1,0)","v":0}]
[]
[]
[null,{"$f":"Textes!A317","v":"Nombre de rotations"},null,null,{"$f":"SUM(D25,D35,D45,D55,D65,D77,D87,D97,D107,D117,D127,D139)","v":0}]
[]
[null,{"$f":"Textes!A318","v":"Durée d'occupation"},null,null,{"$f":"IF((H24+H34+H44+H54+H64+H76+H86+H96+H106+H116+H126+H138)>0,(H24+H34+H44+H54+H64+H76+H86+H96+H106+H116+H126+H138)/SUM(G144:G155),0)","v":0},null,null,{"$f":"Textes!A326","v":"(moyenne, sans interruption entre "}]
[null,{"$f":"Textes!A319","v":"par rotation"},null,null,null,null,null,{"$f":"Textes!A327","v":"les rotations)"}]
[]
[null,{"$f":"Textes!A320","v":"Durée d'occupation"},null,"B(eff)",{"$f":"(N24+N34+N44+N54+N64+N76+N86+N96+N106+N116+N126+N138)","v":0},null,null,{"$f":"Textes!A328","v":"(nombre total de jours, sans interruption entre"}]
[null,{"$f":"Textes!A321","v":"totale"},null,null,null,null,null,{"$f":"Textes!A329","v":"les rotations)"}]
[]
[null,{"$f":"Textes!A322","v":"Durée d'occupation"},null,"B(min)",270,null,null,{"$f":"Textes!A330","v":"(durée d'occupation minimale"}]
[null,{"$f":"Textes!A323","v":"minimale par an"},null,null,null,null,null,{"$f":"Textes!A331","v":"pour une utilisation normale du poulailler)"}]
[]
[null,{"$f":"Textes!A324","v":"Durée d'occupation"},null,"B(min)",{"$f":"IF(K6 = \"\",0,E166/365*K6)","v":0},null,null,{"$f":"Textes!A330","v":"(durée d'occupation minimale"}]
[null,{"$f":"Textes!A325","v":"minimale par periode"},null,null,null,null,null,{"$f":"Textes!A332","v":"calculée pour la periode)"}]
[]
[null,null,null,null,null,null,null,null,null,null,null,null,null,null,null,null,null,{"$f":"B141","v":"Effectif moyen"}]
[null,{"$f":"B141 & \" \" & R173","v":"Effectif moyen au poulailler 1"},null,null,null,null,null,null,null,null,{"$f":"IF($E$163>=$E$169,K142,K142/$E$169*$E$163)","v":0},null,null,null,null,null,null,{"$f":"Textes!A333","v":"au poulailler 1"},null,{"$f":"IF($E$163>=$E$169,T142,T142/$E$169*$E$163)","v":0}]
[]
[null,{"$f":"Textes!A336","v":"correspond à l'effectif exprimé en UGB"},null,null,null,null,null,null,null,null,{"$f":"K173*Faktoren!E10","v":0}]
[]
[null,{"$f":"+Textes!A73","v":"Organisation de contrôle, Date:"},null,null,null,null,null,{"$f":"+Textes!A88","v":"Signature:"}]
[]
[null,{"$f":"+Textes!A77","v":"Exploitant, Date:"},null,null,null,null,null,{"$f":"+Textes!A88","v":"Signature:"}]

{"sheet":"Poulet2","index":29,"n_rows":179,"n_cols":20,"rows_kept":179,"cut":false,"hidden":true,"merged":[[168,3,169,3],[168,4,169,4],[165,3,166,3],[159,4,160,4],[165,4,166,4],[162,4,163,4],[162,3,163,3]]}
[]
[null,null,null,null,null,null,null,null,null,null,null,{"$f":"Textes!A268","v":"Poulailler 2"}]
[null,{"$f":"Textes!A273","v":"Attention: "}]
[null,{"$f":"Textes!A274","v":"               Travaux commencés avant la période et non terminés pendant la période sont à saisir entièrement !"}]
[]
[null,{"$f":"Textes!A19","v":"Période:"},null,null,{"$f":"Textes!A20","v":"Date début:"},{"$f":"IF(Inv!I8=0,\"\",Inv!I8)","v":""},null,{"$f":"Textes!A21","v":"Date fin:"},{"$f":"IF(Inv!I9=0,\"\",Inv!I9)","v":""},{"$f":"Textes!A22","v":"Durée en jours:"},{"$f":"IF(OR(F6=\"\",I6=\"\"),\"\",I6-F6+1)","v":""}]
[null,null,null,null,null,{"$f":"YEAR(F6)","v":{"$error":"#VALUE!"}}]
[null,{"$f":"+Textes!A9","v":"No cantonal:"},null,null,{"$f":"IF(Inv!D4=0,\"\",Inv!D4)","v":""}]
[null,{"$f":"+Textes!A10","v":"Nom:"},null,null,{"$f":"IF(Inv!D5=0,\"\",Inv!D6 & \" \" & Inv!D5)","v":""}]
[null,{"$f":"+Textes!A13","v":"Adresse:"},null,null,{"$f":"IF(Inv!D7=0,\"\",Inv!D7)","v":""}]
[null,{"$f":"+Textes!A14","v":"NPA, lieu:"},null,null,{"$f":"IF(Inv!D9=0,\"\",Inv!D9)","v":""}]
[]
[null,null,null,null,null,null,null,{"$f":"Textes!A278","v":"Jours "},null,{"$f":"Textes!A282","v":"Nbre d'ani-"},{"$f":"Textes!A285","v":"Nombre déter-"},null,null,null,null,"Erkennen",null,{"$f":"I15","v":"Coefficient"},{"$f":"J13","v":"Nbre d'ani-"},{"$f":"D15","v":"Nombre d'animaux"}]
[null,null,null,null,null,null,"Tier-",{"$f":"Textes!A279","v":"d'engrais-"},null,{"$f":"Textes!A283","v":"maux abattus"},{"$f":"Textes!A286","v":"minant d'animaux"},null,null,null,"Datum ","letzter Umtrieb",null,{"$f":"Textes!A288","v":"pour valeurs"},{"$f":"J14","v":"maux abattus"},{"$f":"K15","v":"par rotation"}]
[null,{"$f":"Textes!A275","v":"Date"},null,{"$f":"Textes!A276","v":"Nombre d'animaux"},null,{"$f":"Textes!A277","v":"kg PV total"},"Bestand",{"$f":"Textes!A280","v":"sement"},{"$f":"Textes!A281","v":"Coefficient"},{"$f":"Textes!A284","v":"x coefficient"},{"$f":"Textes!A287","v":"par rotation"},null,null,null,"(Hilfswert)","für Abgrenzung",null,{"$f":"Textes!A289","v":"minimales (vm)"},"x coefficient",{"$f":"Textes!A290","v":"pour vm"}]
[null,{"$f":"Textes!A291","v":"Rotation 1"},{"$f":"Jahr","v":{"$error":"#VALUE!"}}]
[null,null,{"$f":"IF(ISERROR(Jahr), \"\", IF($F$6>B17,\"\",IF(B17>$I$6,Jahr + 1,Jahr)))","v":""},null,{"$f":"Textes!A303","v":"Mise en poulailler"},{"$f":"D17*0.04","v":0},{"$f":"IF(D17>0,D17,0)","v":0},null,null,null,null,null,{"$f":"IF(OR(B17=\"\",D17=\"\"),0,IF(B17<F$6,H17+(F$6-B17)-1,IF((I$6-B17)=0,1,H17+(I$6-B17))))","v":0},{"$f":"IF(D17=\"\",0,IF(M17=0,VLOOKUP(1,Faktoren!$B$16:$D$55,2)/1000,VLOOKUP(M17,Faktoren!$B$16:$D$55,2)/1000))","v":0},null,null,null,{"$f":"IF(AND(H17 > 0, B17 > 0), LOOKUP(H17,INDEX(Faktoren!data,,1),INDEX(Faktoren!data,,5)),0)","v":0},{"$f":"D17:D23 * R17:R23","v":0}]
[null,null,"",null,{"$f":"Textes!A304","v":"1er abattage"},null,{"$f":"IF(D17-D18>0,D17-D18,0)","v":0},{"$f":"IF(AND(D18>0,B18>0),B18-B17+1,0)","v":0},{"$f":"IF(H18>0,IF(H18>Faktoren!$D$5,Faktoren!$E$4,Faktoren!$E$5),0)","v":0},{"$f":"IF(H18>0,D18*I18,0)","v":0},null,null,{"$f":"IF(OR(B18=\"\",D18=\"\"),0,IF(B18<F$6,H18+(F$6-B18)-1,H18+(I$6-B18)))","v":0},{"$f":"IF(OR(D18=\"\",M18=0),0,VLOOKUP(M18,Faktoren!$B$16:$D$55,2)/1000)","v":0},null,null,null,{"$f":"IF(AND(H18 > 0, B18 > 0), LOOKUP(H18,INDEX(Faktoren!data,,1),INDEX(Faktoren!data,,5)),0)","v":0},0]
[null,null,"",null,{"$f":"Textes!A305","v":"2e abattage"},null,{"$f":"IF(D17-D18-D19>0,D17-D18-D19,0)","v":0},{"$f":"IF(AND(D19>0,B19>0),B19-B17+1,0)","v":0},{"$f":"IF(H19>0,IF(H19>Faktoren!$D$5,Faktoren!$E$4,Faktoren!$E$5),0)","v":0},{"$f":"IF(H19>0,D19*I19,0)","v":0},null,null,{"$f":"IF(OR(B19=\"\",D19=\"\"),0,IF(B19<F$6,H19+(F$6-B19)-1,H19+(I$6-B19)))","v":0},{"$f":"IF(OR(D19=\"\",M19=0),0,VLOOKUP(M19,Faktoren!$B$16:$D$55,2)/1000)","v":0},null,null,null,{"$f":"IF(AND(H19 > 0, B19 > 0), LOOKUP(H19,INDEX(Faktoren!data,,1),INDEX(Faktoren!data,,5)),0)","v":0},0]
[null,null,"",null,{"$f":"Textes!A306","v":"3e abattage"},null,{"$f":"IF(D17-D18-D19-D20>0,D17-D18-D19-D20,0)","v":0},{"$f":"IF(AND(D20>0,B20>0),B20-B17+1,0)","v":0},{"$f":"IF(H20>0,IF(H20>Faktoren!$D$5,Faktoren!$E$4,Faktoren!$E$5),0)","v":0},{"$f":"IF(H20>0,D20*I20,0)","v":0},null,null,{"$f":"IF(OR(B20=\"\",D20=\"\"),0,IF(B20<F$6,H20+(F$6-B20)-1,H20+(I$6-B20)))","v":0},{"$f":"IF(OR(D20=\"\",M20=0),0,VLOOKUP(M20,Faktoren!$B$16:$D$55,2)/1000)","v":0},null,null,null,{"$f":"IF(AND(H20 > 0, B20 > 0), LOOKUP(H20,INDEX(Faktoren!data,,1),INDEX(Faktoren!data,,5)),0)","v":0},0]
[null,null,"",null,{"$f":"Textes!A307","v":"4e abattage"},null,{"$f":"IF(D17-D18-D19-D20-D21>0,D17-D18-D19-D20-D21,0)","v":0},{"$f":"IF(AND(D21>0,B21>0),B21-B17+1,0)","v":0},{"$f":"IF(H21>0,IF(H21>Faktoren!$D$5,Faktoren!$E$4,Faktoren!$E$5),0)","v":0},{"$f":"IF(H21>0,D21*I21,0)","v":0},null,null,{"$f":"IF(OR(B21=\"\",D21=\"\"),0,IF(B21<F$6,H21+(F$6-B21)-1,H21+(I$6-B21)))","v":0},{"$f":"IF(OR(D21=\"\",M21=0),0,VLOOKUP(M21,Faktoren!$B$16:$D$55,2)/1000)","v":0},null,null,null,{"$f":"IF(AND(H21 > 0, B21 > 0), LOOKUP(H21,INDEX(Faktoren!data,,1),INDEX(Faktoren!data,,5)),0)","v":0},0]
[null,null,"",null,{"$f":"Textes!A308","v":"5e abattage"},null,{"$f":"IF(D17-D18-D19-D20-D21-D22>0,D17-D18-D19-D20-D21-D22,0)","v":0},{"$f":"IF(AND(D22>0,B22>0),B22-B17+1,0)","v":0},{"$f":"IF(H22>0,IF(H22>Faktoren!$D$5,Faktoren!$E$4,Faktoren!$E$5),0)","v":0},{"$f":"IF(H22>0,D22*I22,0)","v":0},null,null,{"$f":"IF(OR(B22=\"\",D22=\"\"),0,IF(B22<F$6,H22+(F$6-B22)-1,H22+(I$6-B22)))","v":0},{"$f":"IF(OR(D22=\"\",M22=0),0,VLOOKUP(M22,Faktoren!$B$16:$D$55,2)/1000)","v":0},null,null,null,{"$f":"IF(AND(H22 > 0, B22 > 0), LOOKUP(H22,INDEX(Faktoren!data,,1),INDEX(Faktoren!data,,5)),0)","v":0},0]
[null,{"$f":"IF(SUM(B17:B22) > 0,E23,\"\")","v":""},null,{"$f":"+D17-SUM(D18:D22)","v":0},{"$f":"Textes!A309","v":"pertes"},{"$f":"D23*0.6","v":0},null,null,{"$f":"IF(D23>0,Faktoren!$E$7,0)","v":0},{"$f":"IF(D23>0,D23*I23,0)","v":0},{"$f":"SUM(J18:J23)","v":0},null,{"$f":"IF(B17=F6,G17,IF(MIN(B17:B22)>$F$6,0,VLOOKUP($F$6,B17:G22,6)))","v":0},null,{"$f":"MAX(B17:B22)","v":"00:00:00"},{"$f":"IF(OR($F$6=\"\",I$6=\"\",O23<F$6),99,IF(AND(B17>=F$6,O23<=I$6),0,IF(AND(B17>=F$6,O23>I$6),2,1)))","v":99},null,{"$f":"IF(AND(H23 > 0, B23 > 0), LOOKUP(H23,INDEX(Faktoren!data,,1),INDEX(Faktoren!data,,5)),0)","v":0},0,{"$f":"SUM(S17:S23)","v":0}]
[null,null,null,{"$f":"IF(D17>0,ROUND(+D23/D17*100,1),0)","v":0},{"$f":"Textes!A310","v":"pertes en %"},null,"belegt",{"$f":"MAX(H17:H22)","v":0},{"$f":"Textes!A312","v":"jours poulailler occupé"},null,null,null,null,{"$f":"IF(P23=1,O23-$F$6+1,H24)","v":0}]
[null,null,null,{"$f":"IF(P23=99,0,IF(P23=0,H24/MAX(H18:H22),IF(P23=1,(O23-$F$6)/H24,(H24-(O23-I$6))/H24)))","v":0},{"$f":"Textes!A311","v":"Rotations"},null,null,{"$f":"IF(B27<>0,(B27-O23),0)","v":0},{"$f":"Textes!A313","v":"jours poulailler inoccupé"}]
[null,{"$f":"Textes!A292","v":"Rotation 2"}]
[null,null,{"$f":"IF(ISERROR(Jahr), \"\", IF($F$6>B27,\"\",IF(B27>$I$6,Jahr + 1,Jahr)))","v":""},null,{"$f":"Textes!A303","v":"Mise en poulailler"},{"$f":"D27*0.04","v":0},{"$f":"IF(D27>0,D27,0)","v":0},null,null,null,null,null,{"$f":"IF(OR(B27=\"\",D27=\"\"),0,IF((I$6-B27)=0,1,H27+(I$6-B27)))","v":0},{"$f":"IF(D27=\"\",0,VLOOKUP(M27,Faktoren!$B$16:$D$55,2)/1000)","v":0},null,null,null,{"$f":"IF(AND(H27 > 0, B27 > 0), LOOKUP(H27,INDEX(Faktoren!data,,1),INDEX(Faktoren!data,,5)),0)","v":0},{"$f":"D27:D33 * R27:R33","v":0}]
[null,null,"",null,{"$f":"Textes!A304","v":"1er abattage"},null,{"$f":"IF(D27-D28>0,D27-D28,0)","v":0},{"$f":"IF(AND(D28>0,B28>0),B28-B27+1,0)","v":0},{"$f":"IF(H28>0,IF(H28>Faktoren!$D$5,Faktoren!$E$4,Faktoren!$E$5),0)","v":0},{"$f":"IF(H28>0,D28*I28,0)","v":0},null,null,{"$f":"IF(OR(B28=\"\",D28=\"\"),0,H28+(I$6-B28))","v":0},{"$f":"IF(D28=\"\",0,VLOOKUP(M28,Faktoren!$B$16:$D$55,2)/1000)","v":0},null,null,null,{"$f":"IF(AND(H28 > 0, B28 > 0), LOOKUP(H28,INDEX(Faktoren!data,,1),INDEX(Faktoren!data,,5)),0)","v":0},0]
[null,null,"",null,{"$f":"Textes!A305","v":"2e abattage"},null,{"$f":"IF(D27-D28-D29>0,D27-D28-D29,0)","v":0},{"$f":"IF(AND(D29>0,B29>0),B29-B27+1,0)","v":0},{"$f":"IF(H29>0,IF(H29>Faktoren!$D$5,Faktoren!$E$4,Faktoren!$E$5),0)","v":0},{"$f":"IF(H29>0,D29*I29,0)","v":0},null,null,{"$f":"IF(OR(B29=\"\",D29=\"\"),0,H29+(I$6-B29))","v":0},{"$f":"IF(D29=\"\",0,VLOOKUP(M29,Faktoren!$B$16:$D$55,2)/1000)","v":0},null,null,null,{"$f":"IF(AND(H29 > 0, B29 > 0), LOOKUP(H29,INDEX(Faktoren!data,,1),INDEX(Faktoren!data,,5)),0)","v":0},0]
[null,null,"",null,{"$f":"Textes!A306","v":"3e abattage"},null,{"$f":"IF(D27-D28-D29-D30>0,D27-D28-D29-D30,0)","v":0},{"$f":"IF(AND(D30>0,B30>0),B30-B27+1,0)","v":0},{"$f":"IF(H30>0,IF(H30>Faktoren!$D$5,Faktoren!$E$4,Faktoren!$E$5),0)","v":0},{"$f":"IF(H30>0,D30*I30,0)","v":0},null,null,{"$f":"IF(OR(B30=\"\",D30=\"\"),0,H30+(I$6-B30))","v":0},{"$f":"IF(D30=\"\",0,VLOOKUP(M30,Faktoren!$B$16:$D$55,2)/1000)","v":0},null,null,null,{"$f":"IF(AND(H30 > 0, B30 > 0), LOOKUP(H30,INDEX(Faktoren!data,,1),INDEX(Faktoren!data,,5)),0)","v":0},0]
[null,null,"",null,{"$f":"Textes!A307","v":"4e abattage"},null,{"$f":"IF(D27-D28-D29-D30-D31>0,D27-D28-D29-D30-D31,0)","v":0},{"$f":"IF(AND(D31>0,B31>0),B31-B27+1,0)","v":0},{"$f":"IF(H31>0,IF(H31>Faktoren!$D$5,Faktoren!$E$4,Faktoren!$E$5),0)","v":0},{"$f":"IF(H31>0,D31*I31,0)","v":0},null,null,{"$f":"IF(OR(B31=\"\",D31=\"\"),0,H31+(I$6-B31))","v":0},{"$f":"IF(D31=\"\",0,VLOOKUP(M31,Faktoren!$B$16:$D$55,2)/1000)","v":0},null,null,null,{"$f":"IF(AND(H31 > 0, B31 > 0), LOOKUP(H31,INDEX(Faktoren!data,,1),INDEX(Faktoren!data,,5)),0)","v":0},0]
[null,null,"",null,{"$f":"Textes!A308","v":"5e abattage"},null,{"$f":"IF(D27-D28-D29-D30-D31-D32>0,D27-D28-D29-D30-D31-D32,0)","v":0},{"$f":"IF(AND(D32>0,B32>0),B32-B27+1,0)","v":0},{"$f":"IF(H32>0,IF(H32>Faktoren!$D$5,Faktoren!$E$4,Faktoren!$E$5),0)","v":0},{"$f":"IF(H32>0,D32*I32,0)","v":0},null,null,{"$f":"IF(OR(B32=\"\",D32=\"\"),0,H32+(I$6-B32))","v":0},{"$f":"IF(D32=\"\",0,VLOOKUP(M32,Faktoren!$B$16:$D$55,2)/1000)","v":0},null,null,null,{"$f":"IF(AND(H32 > 0, B32 > 0), LOOKUP(H32,INDEX(Faktoren!data,,1),INDEX(Faktoren!data,,5)),0)","v":0},0]
[null,{"$f":"IF(SUM(B27:B32) > 0,E33,\"\")","v":""},null,{"$f":"+D27-SUM(D28:D32)","v":0},{"$f":"Textes!A309","v":"pertes"},{"$f":"D33*0.6","v":0},null,null,{"$f":"IF(D33>0,Faktoren!$E$7,0)","v":0},{"$f":"IF(D33>0,D33*I33,0)","v":0},{"$f":"SUM(J28:J33)","v":0},null,{"$f":"IF(MAX(B27:B32)<$I$6,0,VLOOKUP($I$6,B27:G32,6))","v":0},null,{"$f":"MAX(B27:B32)","v":"00:00:00"},{"$f":"IF(OR($F$6=\"\",I$6=\"\",O33<F$6),99,IF(AND(O33>F$6,O33<=I$6),0,1))","v":99},null,{"$f":"IF(AND(H33 > 0, B33 > 0), LOOKUP(H33,INDEX(Faktoren!data,,1),INDEX(Faktoren!data,,5)),0)","v":0},0,{"$f":"SUM(S27:S33)","v":0}]
[null,null,null,{"$f":"IF(D27>0,ROUND(+D33/D27*100,1),0)","v":0},{"$f":"Textes!A310","v":"pertes en %"},null,"belegt",{"$f":"MAX(H27:H32)","v":0},{"$f":"Textes!A312","v":"jours poulailler occupé"},null,null,null,null,{"$f":"IF(P33=1,$I$6-B27+1,H34)","v":0}]
[null,null,null,{"$f":"IF(P33=99,0,IF(P33=0,H34/MAX(H28:H32),IF(P33=1,(H34-(O33-$I$6))/H34,0)))","v":0},{"$f":"Textes!A311","v":"Rotations"},null,null,{"$f":"IF(B37<>0,(B37-O33),0)","v":0},{"$f":"Textes!A313","v":"jours poulailler inoccupé"}]
[null,{"$f":"Textes!A293","v":"Rotation 3"}]
[null,null,{"$f":"IF(ISERROR(Jahr), \"\", IF($F$6>B37,\"\",IF(B37>$I$6,Jahr + 1,Jahr)))","v":""},null,{"$f":"Textes!A303","v":"Mise en poulailler"},{"$f":"D37*0.04","v":0},{"$f":"IF(D37>0,D37,0)","v":0},null,null,null,null,null,{"$f":"IF(OR(B37=\"\",D37=\"\"),0,IF((I$6-B37)=0,1,H37+(I$6-B37)))","v":0},{"$f":"IF(D37=\"\",0,VLOOKUP(M37,Faktoren!$B$16:$D$55,2)/1000)","v":0},null,null,null,{"$f":"IF(AND(H37 > 0, B37 > 0), LOOKUP(H37,INDEX(Faktoren!data,,1),INDEX(Faktoren!data,,5)),0)","v":0},{"$f":"D37:D43 * R37:R43","v":0}]
[null,null,"",null,{"$f":"Textes!A304","v":"1er abattage"},null,{"$f":"IF(D37-D38>0,D37-D38,0)","v":0},{"$f":"IF(AND(D38>0,B38>0),B38-B37+1,0)","v":0},{"$f":"IF(H38>0,IF(H38>Faktoren!$D$5,Faktoren!$E$4,Faktoren!$E$5),0)","v":0},{"$f":"IF(H38>0,D38*I38,0)","v":0},null,null,{"$f":"IF(OR(B38=\"\",D38=\"\"),0,H38+(I$6-B38))","v":0},{"$f":"IF(D38=\"\",0,VLOOKUP(M38,Faktoren!$B$16:$D$55,2)/1000)","v":0},null,null,null,{"$f":"IF(AND(H38 > 0, B38 > 0), LOOKUP(H38,INDEX(Faktoren!data,,1),INDEX(Faktoren!data,,5)),0)","v":0},0]
[null,null,"",null,{"$f":"Textes!A305","v":"2e abattage"},null,{"$f":"IF(D37-D38-D39>0,D37-D38-D39,0)","v":0},{"$f":"IF(AND(D39>0,B39>0),B39-B37+1,0)","v":0},{"$f":"IF(H39>0,IF(H39>Faktoren!$D$5,Faktoren!$E$4,Faktoren!$E$5),0)","v":0},{"$f":"IF(H39>0,D39*I39,0)","v":0},null,null,{"$f":"IF(OR(B39=\"\",D39=\"\"),0,H39+(I$6-B39))","v":0},{"$f":"IF(D39=\"\",0,VLOOKUP(M39,Faktoren!$B$16:$D$55,2)/1000)","v":0},null,null,null,{"$f":"IF(AND(H39 > 0, B39 > 0), LOOKUP(H39,INDEX(Faktoren!data,,1),INDEX(Faktoren!data,,5)),0)","v":0},0]
[null,null,"",null,{"$f":"Textes!A306","v":"3e abattage"},null,{"$f":"IF(D37-D38-D39-D40>0,D37-D38-D39-D40,0)","v":0},{"$f":"IF(AND(D40>0,B40>0),B40-B37+1,0)","v":0},{"$f":"IF(H40>0,IF(H40>Faktoren!$D$5,Faktoren!$E$4,Faktoren!$E$5),0)","v":0},{"$f":"IF(H40>0,D40*I40,0)","v":0},null,null,{"$f":"IF(OR(B40=\"\",D40=\"\"),0,H40+(I$6-B40))","v":0},{"$f":"IF(D40=\"\",0,VLOOKUP(M40,Faktoren!$B$16:$D$55,2)/1000)","v":0},null,null,null,{"$f":"IF(AND(H40 > 0, B40 > 0), LOOKUP(H40,INDEX(Faktoren!data,,1),INDEX(Faktoren!data,,5)),0)","v":0},0]
[null,null,"",null,{"$f":"Textes!A307","v":"4e abattage"},null,{"$f":"IF(D37-D38-D39-D40-D41>0,D37-D38-D39-D40-D41,0)","v":0},{"$f":"IF(AND(D41>0,B41>0),B41-B37+1,0)","v":0},{"$f":"IF(H41>0,IF(H41>Faktoren!$D$5,Faktoren!$E$4,Faktoren!$E$5),0)","v":0},{"$f":"IF(H41>0,D41*I41,0)","v":0},null,null,{"$f":"IF(OR(B41=\"\",D41=\"\"),0,H41+(I$6-B41))","v":0},{"$f":"IF(D41=\"\",0,VLOOKUP(M41,Faktoren!$B$16:$D$55,2)/1000)","v":0},null,null,null,{"$f":"IF(AND(H41 > 0, B41 > 0), LOOKUP(H41,INDEX(Faktoren!data,,1),INDEX(Faktoren!data,,5)),0)","v":0},0]
[null,null,"",null,{"$f":"Textes!A308","v":"5e abattage"},null,{"$f":"IF(D37-D38-D39-D40-D41-D42>0,D37-D38-D39-D40-D41-D42,0)","v":0},{"$f":"IF(AND(D42>0,B42>0),B42-B37+1,0)","v":0},{"$f":"IF(H42>0,IF(H42>Faktoren!$D$5,Faktoren!$E$4,Faktoren!$E$5),0)","v":0},{"$f":"IF(H42>0,D42*I42,0)","v":0},null,null,{"$f":"IF(OR(B42=\"\",D42=\"\"),0,H42+(I$6-B42))","v":0},{"$f":"IF(D42=\"\",0,VLOOKUP(M42,Faktoren!$B$16:$D$55,2)/1000)","v":0},null,null,null,{"$f":"IF(AND(H42 > 0, B42 > 0), LOOKUP(H42,INDEX(Faktoren!data,,1),INDEX(Faktoren!data,,5)),0)","v":0},0]
[null,{"$f":"IF(SUM(B37:B42) > 0,E43,\"\")","v":""},null,{"$f":"+D37-SUM(D38:D42)","v":0},{"$f":"Textes!A309","v":"pertes"},{"$f":"D43*0.6","v":0},null,null,{"$f":"IF(D43>0,Faktoren!$E$7,0)","v":0},{"$f":"IF(D43>0,D43*I43,0)","v":0},{"$f":"SUM(J38:J43)","v":0},null,{"$f":"IF(MAX(B37:B42)<$I$6,0,VLOOKUP($I$6,B37:G42,6))","v":0},null,{"$f":"MAX(B37:B42)","v":"00:00:00"},{"$f":"IF(OR($F$6=\"\",I$6=\"\",O43<F$6),99,IF(AND(O43>F$6,O43<=I$6),0,1))","v":99},null,{"$f":"IF(AND(H43 > 0, B43 > 0), LOOKUP(H43,INDEX(Faktoren!data,,1),INDEX(Faktoren!data,,5)),0)","v":0},0,{"$f":"SUM(S37:S43)","v":0}]
[null,null,null,{"$f":"IF(D37>0,ROUND(+D43/D37*100,1),0)","v":0},{"$f":"Textes!A310","v":"pertes en %"},null,"belegt",{"$f":"MAX(H37:H42)","v":0},{"$f":"Textes!A312","v":"jours poulailler occupé"},null,null,null,null,{"$f":"IF(P43=1,$I$6-B37+1,H44)","v":0}]
[null,null,null,{"$f":"IF(P43=99,0,IF(P43=0,H44/MAX(H38:H42),IF(P43=1,(H44-(O43-$I$6))/H44,0)))","v":0},{"$f":"Textes!A311","v":"Rotations"},null,null,{"$f":"IF(B47<>0,(B47-O43),0)","v":0},{"$f":"Textes!A313","v":"jours poulailler inoccupé"}]
[null,{"$f":"Textes!A294","v":"Rotation 4"}]
[null,null,{"$f":"IF(ISERROR(Jahr), \"\", IF($F$6>B47,\"\",IF(B47>$I$6,Jahr + 1,Jahr)))","v":""},null,{"$f":"Textes!A303","v":"Mise en poulailler"},{"$f":"D47*0.04","v":0},{"$f":"IF(D47>0,D47,0)","v":0},null,null,null,null,null,{"$f":"IF(OR(B47=\"\",D47=\"\"),0,IF((I$6-B47)=0,1,H47+(I$6-B47)))","v":0},{"$f":"IF(D47=\"\",0,VLOOKUP(M47,Faktoren!$B$16:$D$55,2)/1000)","v":0},null,null,null,{"$f":"IF(AND(H47 > 0, B47 > 0), LOOKUP(H47,INDEX(Faktoren!data,,1),INDEX(Faktoren!data,,5)),0)","v":0},{"$f":"D47:D53 * R47:R53","v":0}]
[null,null,"",null,{"$f":"Textes!A304","v":"1er abattage"},null,{"$f":"IF(D47-D48>0,D47-D48,0)","v":0},{"$f":"IF(AND(D48>0,B48>0),B48-B47+1,0)","v":0},{"$f":"IF(H48>0,IF(H48>Faktoren!$D$5,Faktoren!$E$4,Faktoren!$E$5),0)","v":0},{"$f":"IF(H48>0,D48*I48,0)","v":0},null,null,{"$f":"IF(OR(B48=\"\",D48=\"\"),0,H48+(I$6-B48))","v":0},{"$f":"IF(D48=\"\",0,VLOOKUP(M48,Faktoren!$B$16:$D$55,2)/1000)","v":0},null,null,null,{"$f":"IF(AND(H48 > 0, B48 > 0), LOOKUP(H48,INDEX(Faktoren!data,,1),INDEX(Faktoren!data,,5)),0)","v":0},0]
[null,null,"",null,{"$f":"Textes!A305","v":"2e abattage"},null,{"$f":"IF(D47-D48-D49>0,D47-D48-D49,0)","v":0},{"$f":"IF(AND(D49>0,B49>0),B49-B47+1,0)","v":0},{"$f":"IF(H49>0,IF(H49>Faktoren!$D$5,Faktoren!$E$4,Faktoren!$E$5),0)","v":0},{"$f":"IF(H49>0,D49*I49,0)","v":0},null,null,{"$f":"IF(OR(B49=\"\",D49=\"\"),0,H49+(I$6-B49))","v":0},{"$f":"IF(D49=\"\",0,VLOOKUP(M49,Faktoren!$B$16:$D$55,2)/1000)","v":0},null,null,null,{"$f":"IF(AND(H49 > 0, B49 > 0), LOOKUP(H49,INDEX(Faktoren!data,,1),INDEX(Faktoren!data,,5)),0)","v":0},0]
[null,null,"",null,{"$f":"Textes!A306","v":"3e abattage"},null,{"$f":"IF(D47-D48-D49-D50>0,D47-D48-D49-D50,0)","v":0},{"$f":"IF(AND(D50>0,B50>0),B50-B47+1,0)","v":0},{"$f":"IF(H50>0,IF(H50>Faktoren!$D$5,Faktoren!$E$4,Faktoren!$E$5),0)","v":0},{"$f":"IF(H50>0,D50*I50,0)","v":0},null,null,{"$f":"IF(OR(B50=\"\",D50=\"\"),0,H50+(I$6-B50))","v":0},{"$f":"IF(D50=\"\",0,VLOOKUP(M50,Faktoren!$B$16:$D$55,2)/1000)","v":0},null,null,null,{"$f":"IF(AND(H50 > 0, B50 > 0), LOOKUP(H50,INDEX(Faktoren!data,,1),INDEX(Faktoren!data,,5)),0)","v":0},0]
[null,null,"",null,{"$f":"Textes!A307","v":"4e abattage"},null,{"$f":"IF(D47-D48-D49-D50-D51>0,D47-D48-D49-D50-D51,0)","v":0},{"$f":"IF(AND(D51>0,B51>0),B51-B47+1,0)","v":0},{"$f":"IF(H51>0,IF(H51>Faktoren!$D$5,Faktoren!$E$4,Faktoren!$E$5),0)","v":0},{"$f":"IF(H51>0,D51*I51,0)","v":0},null,null,{"$f":"IF(OR(B51=\"\",D51=\"\"),0,H51+(I$6-B51))","v":0},{"$f":"IF(D51=\"\",0,VLOOKUP(M51,Faktoren!$B$16:$D$55,2)/1000)","v":0},null,null,null,{"$f":"IF(AND(H51 > 0, B51 > 0), LOOKUP(H51,INDEX(Faktoren!data,,1),INDEX(Faktoren!data,,5)),0)","v":0},0]
[null,null,"",null,{"$f":"Textes!A308","v":"5e abattage"},null,{"$f":"IF(D47-D48-D49-D50-D51-D52>0,D47-D48-D49-D50-D51-D52,0)","v":0},{"$f":"IF(AND(D52>0,B52>0),B52-B47+1,0)","v":0},{"$f":"IF(H52>0,IF(H52>Faktoren!$D$5,Faktoren!$E$4,Faktoren!$E$5),0)","v":0},{"$f":"IF(H52>0,D52*I52,0)","v":0},null,null,{"$f":"IF(OR(B52=\"\",D52=\"\"),0,H52+(I$6-B52))","v":0},{"$f":"IF(D52=\"\",0,VLOOKUP(M52,Faktoren!$B$16:$D$55,2)/1000)","v":0},null,null,null,{"$f":"IF(AND(H52 > 0, B52 > 0), LOOKUP(H52,INDEX(Faktoren!data,,1),INDEX(Faktoren!data,,5)),0)","v":0},0]
[null,{"$f":"IF(SUM(B47:B52) > 0,E53,\"\")","v":""},null,{"$f":"+D47-SUM(D48:D52)","v":0},{"$f":"Textes!A309","v":"pertes"},{"$f":"D53*0.6","v":0},null,null,{"$f":"IF(D53>0,Faktoren!$E$7,0)","v":0},{"$f":"IF(D53>0,D53*I53,0)","v":0},{"$f":"SUM(J48:J53)","v":0},null,{"$f":"IF(MAX(B47:B52)<$I$6,0,VLOOKUP($I$6,B47:G52,6))","v":0},null,{"$f":"MAX(B47:B52)","v":"00:00:00"},{"$f":"IF(OR($F$6=\"\",I$6=\"\",O53<F$6),99,IF(AND(O53>F$6,O53<=I$6),0,1))","v":99},null,{"$f":"IF(AND(H53 > 0, B53 > 0), LOOKUP(H53,INDEX(Faktoren!data,,1),INDEX(Faktoren!data,,5)),0)","v":0},0,{"$f":"SUM(S47:S53)","v":0}]
[null,null,null,{"$f":"IF(D47>0,ROUND(+D53/D47*100,1),0)","v":0},{"$f":"Textes!A310","v":"pertes en %"},null,"belegt",{"$f":"MAX(H47:H52)","v":0},{"$f":"Textes!A312","v":"jours poulailler occupé"},null,null,null,null,{"$f":"IF(P53=1,$I$6-B47+1,H54)","v":0}]
[null,null,null,{"$f":"IF(P53=99,0,IF(P53=0,H54/MAX(H48:H52),IF(P53=1,(H54-(O53-$I$6))/H54,0)))","v":0},{"$f":"Textes!A311","v":"Rotations"},null,null,{"$f":"IF(B57<>0,(B57-O53),0)","v":0},{"$f":"Textes!A313","v":"jours poulailler inoccupé"}]
[null,{"$f":"Textes!A295","v":"Rotation 5"}]
[null,null,{"$f":"IF(ISERROR(Jahr), \"\", IF($F$6>B57,\"\",IF(B57>$I$6,Jahr + 1,Jahr)))","v":""},null,{"$f":"Textes!A303","v":"Mise en poulailler"},{"$f":"D57*0.04","v":0},{"$f":"IF(D57>0,D57,0)","v":0},null,null,null,null,null,{"$f":"IF(OR(B57=\"\",D57=\"\"),0,IF((I$6-B57)=0,1,H57+(I$6-B57)))","v":0},{"$f":"IF(D57=\"\",0,VLOOKUP(M57,Faktoren!$B$16:$D$55,2)/1000)","v":0},null,null,null,{"$f":"IF(AND(H57 > 0, B57 > 0), LOOKUP(H57,INDEX(Faktoren!data,,1),INDEX(Faktoren!data,,5)),0)","v":0},{"$f":"D57:D63 * R57:R63","v":0}]
[null,null,"",null,{"$f":"Textes!A304","v":"1er abattage"},null,{"$f":"IF(D57-D58>0,D57-D58,0)","v":0},{"$f":"IF(AND(D58>0,B58>0),B58-B57+1,0)","v":0},{"$f":"IF(H58>0,IF(H58>Faktoren!$D$5,Faktoren!$E$4,Faktoren!$E$5),0)","v":0},{"$f":"IF(H58>0,D58*I58,0)","v":0},null,null,{"$f":"IF(OR(B58=\"\",D58=\"\"),0,H58+(I$6-B58))","v":0},{"$f":"IF(D58=\"\",0,VLOOKUP(M58,Faktoren!$B$16:$D$55,2)/1000)","v":0},null,null,null,{"$f":"IF(AND(H58 > 0, B58 > 0), LOOKUP(H58,INDEX(Faktoren!data,,1),INDEX(Faktoren!data,,5)),0)","v":0},0]
[null,null,"",null,{"$f":"Textes!A305","v":"2e abattage"},null,{"$f":"IF(D57-D58-D59>0,D57-D58-D59,0)","v":0},{"$f":"IF(AND(D59>0,B59>0),B59-B57+1,0)","v":0},{"$f":"IF(H59>0,IF(H59>Faktoren!$D$5,Faktoren!$E$4,Faktoren!$E$5),0)","v":0},{"$f":"IF(H59>0,D59*I59,0)","v":0},null,null,{"$f":"IF(OR(B59=\"\",D59=\"\"),0,H59+(I$6-B59))","v":0},{"$f":"IF(D59=\"\",0,VLOOKUP(M59,Faktoren!$B$16:$D$55,2)/1000)","v":0},null,null,null,{"$f":"IF(AND(H59 > 0, B59 > 0), LOOKUP(H59,INDEX(Faktoren!data,,1),INDEX(Faktoren!data,,5)),0)","v":0},0]
[null,null,"",null,{"$f":"Textes!A306","v":"3e abattage"},null,{"$f":"IF(D57-D58-D59-D60>0,D57-D58-D59-D60,0)","v":0},{"$f":"IF(AND(D60>0,B60>0),B60-B57+1,0)","v":0},{"$f":"IF(H60>0,IF(H60>Faktoren!$D$5,Faktoren!$E$4,Faktoren!$E$5),0)","v":0},{"$f":"IF(H60>0,D60*I60,0)","v":0},null,null,{"$f":"IF(OR(B60=\"\",D60=\"\"),0,H60+(I$6-B60))","v":0},{"$f":"IF(D60=\"\",0,VLOOKUP(M60,Faktoren!$B$16:$D$55,2)/1000)","v":0},null,null,null,{"$f":"IF(AND(H60 > 0, B60 > 0), LOOKUP(H60,INDEX(Faktoren!data,,1),INDEX(Faktoren!data,,5)),0)","v":0},0]
[null,null,"",null,{"$f":"Textes!A307","v":"4e abattage"},null,{"$f":"IF(D57-D58-D59-D60-D61>0,D57-D58-D59-D60-D61,0)","v":0},{"$f":"IF(AND(D61>0,B61>0),B61-B57+1,0)","v":0},{"$f":"IF(H61>0,IF(H61>Faktoren!$D$5,Faktoren!$E$4,Faktoren!$E$5),0)","v":0},{"$f":"IF(H61>0,D61*I61,0)","v":0},null,null,{"$f":"IF(OR(B61=\"\",D61=\"\"),0,H61+(I$6-B61))","v":0},{"$f":"IF(D61=\"\",0,VLOOKUP(M61,Faktoren!$B$16:$D$55,2)/1000)","v":0},null,null,null,{"$f":"IF(AND(H61 > 0, B61 > 0), LOOKUP(H61,INDEX(Faktoren!data,,1),INDEX(Faktoren!data,,5)),0)","v":0},0]
[null,null,"",null,{"$f":"Textes!A308","v":"5e abattage"},null,{"$f":"IF(D57-D58-D59-D60-D61-D62>0,D57-D58-D59-D60-D61-D62,0)","v":0},{"$f":"IF(AND(D62>0,B62>0),B62-B57+1,0)","v":0},{"$f":"IF(H62>0,IF(H62>Faktoren!$D$5,Faktoren!$E$4,Faktoren!$E$5),0)","v":0},{"$f":"IF(H62>0,D62*I62,0)","v":0},null,null,{"$f":"IF(OR(B62=\"\",D62=\"\"),0,H62+(I$6-B62))","v":0},{"$f":"IF(D62=\"\",0,VLOOKUP(M62,Faktoren!$B$16:$D$55,2)/1000)","v":0},null,null,null,{"$f":"IF(AND(H62 > 0, B62 > 0), LOOKUP(H62,INDEX(Faktoren!data,,1),INDEX(Faktoren!data,,5)),0)","v":0},0]
[null,{"$f":"IF(SUM(B57:B62) > 0,E63,\"\")","v":""},null,{"$f":"+D57-SUM(D58:D62)","v":0},{"$f":"Textes!A309","v":"pertes"},{"$f":"D63*0.6","v":0},null,null,{"$f":"IF(D63>0,Faktoren!$E$7,0)","v":0},{"$f":"IF(D63>0,D63*I63,0)","v":0},{"$f":"SUM(J58:J63)","v":0},null,{"$f":"IF(MAX(B57:B62)<$I$6,0,VLOOKUP($I$6,B57:G62,6))","v":0},null,{"$f":"MAX(B57:B62)","v":"00:00:00"},{"$f":"IF(OR($F$6=\"\",I$6=\"\",O63<F$6),99,IF(AND(O63>F$6,O63<=I$6),0,1))","v":99},null,{"$f":"IF(AND(H63 > 0, B63 > 0), LOOKUP(H63,INDEX(Faktoren!data,,1),INDEX(Faktoren!data,,5)),0)","v":0},0,{"$f":"SUM(S57:S63)","v":0}]
[null,null,null,{"$f":"IF(D57>0,ROUND(+D63/D57*100,1),0)","v":0},{"$f":"Textes!A310","v":"pertes en %"},null,"belegt",{"$f":"MAX(H57:H62)","v":0},{"$f":"Textes!A312","v":"jours poulailler occupé"},null,null,null,null,{"$f":"IF(P63=1,$I$6-B57+1,H64)","v":0}]
[null,null,null,{"$f":"IF(P63=99,0,IF(P63=0,H64/MAX(H58:H62),IF(P63=1,(H64-(O63-$I$6))/H64,0)))","v":0},{"$f":"Textes!A311","v":"Rotations"},null,null,{"$f":"IF(B69<>0,(B69-O63),0)","v":0},{"$f":"Textes!A313","v":"jours poulailler inoccupé"}]
[]
[null,{"$f":"Textes!A268","v":"Poulailler 2"},null,null,null,null,null,null,null,null,{"$f":"Textes!A338","v":"page 2"}]
[null,{"$f":"Textes!A296","v":"Rotation 6"}]
[null,null,{"$f":"IF(ISERROR(Jahr), \"\", IF($F$6>B69,\"\",IF(B69>$I$6,Jahr + 1,Jahr)))","v":""},null,{"$f":"Textes!A303","v":"Mise en poulailler"},{"$f":"D69*0.04","v":0},{"$f":"IF(D69>0,D69,0)","v":0},null,null,null,null,null,{"$f":"IF(OR(B69=\"\",D69=\"\"),0,IF((I$6-B69)=0,1,H69+(I$6-B69)))","v":0},{"$f":"IF(D69=\"\",0,VLOOKUP(M69,Faktoren!$B$16:$D$55,2)/1000)","v":0},null,null,null,{"$f":"IF(AND(H69 > 0, B69 > 0), LOOKUP(H69,INDEX(Faktoren!data,,1),INDEX(Faktoren!data,,5)),0)","v":0},{"$f":"D69:D75 * R69:R75","v":0}]
[null,null,"",null,{"$f":"Textes!A304","v":"1er abattage"},null,{"$f":"IF(D69-D70>0,D69-D70,0)","v":0},{"$f":"IF(AND(D70>0,B70>0),B70-B69+1,0)","v":0},{"$f":"IF(H70>0,IF(H70>Faktoren!$D$5,Faktoren!$E$4,Faktoren!$E$5),0)","v":0},{"$f":"IF(H70>0,D70*I70,0)","v":0},null,null,{"$f":"IF(OR(B70=\"\",D70=\"\"),0,H70+(I$6-B70))","v":0},{"$f":"IF(D70=\"\",0,VLOOKUP(M70,Faktoren!$B$16:$D$55,2)/1000)","v":0},null,null,null,{"$f":"IF(AND(H70 > 0, B70 > 0), LOOKUP(H70,INDEX(Faktoren!data,,1),INDEX(Faktoren!data,,5)),0)","v":0},0]
[null,null,"",null,{"$f":"Textes!A305","v":"2e abattage"},null,{"$f":"IF(D69-D70-D71>0,D69-D70-D71,0)","v":0},{"$f":"IF(AND(D71>0,B71>0),B71-B69+1,0)","v":0},{"$f":"IF(H71>0,IF(H71>Faktoren!$D$5,Faktoren!$E$4,Faktoren!$E$5),0)","v":0},{"$f":"IF(H71>0,D71*I71,0)","v":0},null,null,{"$f":"IF(OR(B71=\"\",D71=\"\"),0,H71+(I$6-B71))","v":0},{"$f":"IF(D71=\"\",0,VLOOKUP(M71,Faktoren!$B$16:$D$55,2)/1000)","v":0},null,null,null,{"$f":"IF(AND(H71 > 0, B71 > 0), LOOKUP(H71,INDEX(Faktoren!data,,1),INDEX(Faktoren!data,,5)),0)","v":0},0]
[null,null,"",null,{"$f":"Textes!A306","v":"3e abattage"},null,{"$f":"IF(D69-D70-D71-D72>0,D69-D70-D71-D72,0)","v":0},{"$f":"IF(AND(D72>0,B72>0),B72-B69+1,0)","v":0},{"$f":"IF(H72>0,IF(H72>Faktoren!$D$5,Faktoren!$E$4,Faktoren!$E$5),0)","v":0},{"$f":"IF(H72>0,D72*I72,0)","v":0},null,null,{"$f":"IF(OR(B72=\"\",D72=\"\"),0,H72+(I$6-B72))","v":0},{"$f":"IF(D72=\"\",0,VLOOKUP(M72,Faktoren!$B$16:$D$55,2)/1000)","v":0},null,null,null,{"$f":"IF(AND(H72 > 0, B72 > 0), LOOKUP(H72,INDEX(Faktoren!data,,1),INDEX(Faktoren!data,,5)),0)","v":0},0]
[null,null,"",null,{"$f":"Textes!A307","v":"4e abattage"},null,{"$f":"IF(D69-D70-D71-D72-D73>0,D69-D70-D71-D72-D73,0)","v":0},{"$f":"IF(AND(D73>0,B73>0),B73-B69+1,0)","v":0},{"$f":"IF(H73>0,IF(H73>Faktoren!$D$5,Faktoren!$E$4,Faktoren!$E$5),0)","v":0},{"$f":"IF(H73>0,D73*I73,0)","v":0},null,null,{"$f":"IF(OR(B73=\"\",D73=\"\"),0,H73+(I$6-B73))","v":0},{"$f":"IF(D73=\"\",0,VLOOKUP(M73,Faktoren!$B$16:$D$55,2)/1000)","v":0},null,null,null,{"$f":"IF(AND(H73 > 0, B73 > 0), LOOKUP(H73,INDEX(Faktoren!data,,1),INDEX(Faktoren!data,,5)),0)","v":0},0]
[null,null,"",null,{"$f":"Textes!A308","v":"5e abattage"},null,{"$f":"IF(D69-D70-D71-D72-D73-D74>0,D69-D70-D71-D72-D73-D74,0)","v":0},{"$f":"IF(AND(D74>0,B74>0),B74-B69+1,0)","v":0},{"$f":"IF(H74>0,IF(H74>Faktoren!$D$5,Faktoren!$E$4,Faktoren!$E$5),0)","v":0},{"$f":"IF(H74>0,D74*I74,0)","v":0},null,null,{"$f":"IF(OR(B74=\"\",D74=\"\"),0,H74+(I$6-B74))","v":0},{"$f":"IF(D74=\"\",0,VLOOKUP(M74,Faktoren!$B$16:$D$55,2)/1000)","v":0},null,null,null,{"$f":"IF(AND(H74 > 0, B74 > 0), LOOKUP(H74,INDEX(Faktoren!data,,1),INDEX(Faktoren!data,,5)),0)","v":0},0]
[null,{"$f":"IF(SUM(B69:B74) > 0,E75,\"\")","v":""},null,{"$f":"+D69-SUM(D70:D74)","v":0},{"$f":"Textes!A309","v":"pertes"},{"$f":"D75*0.6","v":0},null,null,{"$f":"IF(D75>0,Faktoren!$E$7,0)","v":0},{"$f":"IF(D75>0,D75*I75,0)","v":0},{"$f":"SUM(J70:J75)","v":0},null,{"$f":"IF(MAX(B69:B74)<$I$6,0,VLOOKUP($I$6,B69:G74,6))","v":0},null,{"$f":"MAX(B69:B74)","v":"00:00:00"},{"$f":"IF(OR($F$6=\"\",I$6=\"\",O75<F$6),99,IF(AND(O75>F$6,O75<=I$6),0,1))","v":99},null,{"$f":"IF(AND(H75 > 0, B75 > 0), LOOKUP(H75,INDEX(Faktoren!data,,1),INDEX(Faktoren!data,,5)),0)","v":0},0,{"$f":"SUM(S69:S75)","v":0}]
[null,null,null,{"$f":"IF(D69>0,ROUND(+D75/D69*100,1),0)","v":0},{"$f":"Textes!A310","v":"pertes en %"},null,"belegt",{"$f":"MAX(H69:H74)","v":0},{"$f":"Textes!A312","v":"jours poulailler occupé"},null,null,null,null,{"$f":"IF(P75=1,$I$6-B69+1,H76)","v":0}]
[null,null,null,{"$f":"IF(P75=99,0,IF(P75=0,H76/MAX(H70:H74),IF(P75=1,(H76-(O75-$I$6))/H76,0)))","v":0},{"$f":"Textes!A311","v":"Rotations"},null,null,{"$f":"IF(B79<>0,(B79-O75),0)","v":0},{"$f":"Textes!A313","v":"jours poulailler inoccupé"}]
[null,{"$f":"Textes!A297","v":"Rotation 7"}]
[null,null,{"$f":"IF(ISERROR(Jahr), \"\", IF($F$6>B79,\"\",IF(B79>$I$6,Jahr + 1,Jahr)))","v":""},null,{"$f":"Textes!A303","v":"Mise en poulailler"},{"$f":"D79*0.04","v":0},{"$f":"IF(D79>0,D79,0)","v":0},null,null,null,null,null,{"$f":"IF(OR(B79=\"\",D79=\"\"),0,IF((I$6-B79)=0,1,H79+(I$6-B79)))","v":0},{"$f":"IF(D79=\"\",0,VLOOKUP(M79,Faktoren!$B$16:$D$55,2)/1000)","v":0},null,null,null,{"$f":"IF(AND(H79 > 0, B79 > 0), LOOKUP(H79,INDEX(Faktoren!data,,1),INDEX(Faktoren!data,,5)),0)","v":0},{"$f":"D79:D85 * R79:R85","v":0}]
[null,null,"",null,{"$f":"Textes!A304","v":"1er abattage"},null,{"$f":"IF(D79-D80>0,D79-D80,0)","v":0},{"$f":"IF(AND(D80>0,B80>0),B80-B79+1,0)","v":0},{"$f":"IF(H80>0,IF(H80>Faktoren!$D$5,Faktoren!$E$4,Faktoren!$E$5),0)","v":0},{"$f":"IF(H80>0,D80*I80,0)","v":0},null,null,{"$f":"IF(OR(B80=\"\",D80=\"\"),0,H80+(I$6-B80))","v":0},{"$f":"IF(D80=\"\",0,VLOOKUP(M80,Faktoren!$B$16:$D$55,2)/1000)","v":0},null,null,null,{"$f":"IF(AND(H80 > 0, B80 > 0), LOOKUP(H80,INDEX(Faktoren!data,,1),INDEX(Faktoren!data,,5)),0)","v":0},0]
[null,null,"",null,{"$f":"Textes!A305","v":"2e abattage"},null,{"$f":"IF(D79-D80-D81>0,D79-D80-D81,0)","v":0},{"$f":"IF(AND(D81>0,B81>0),B81-B79+1,0)","v":0},{"$f":"IF(H81>0,IF(H81>Faktoren!$D$5,Faktoren!$E$4,Faktoren!$E$5),0)","v":0},{"$f":"IF(H81>0,D81*I81,0)","v":0},null,null,{"$f":"IF(OR(B81=\"\",D81=\"\"),0,H81+(I$6-B81))","v":0},{"$f":"IF(D81=\"\",0,VLOOKUP(M81,Faktoren!$B$16:$D$55,2)/1000)","v":0},null,null,null,{"$f":"IF(AND(H81 > 0, B81 > 0), LOOKUP(H81,INDEX(Faktoren!data,,1),INDEX(Faktoren!data,,5)),0)","v":0},0]
[null,null,"",null,{"$f":"Textes!A306","v":"3e abattage"},null,{"$f":"IF(D79-D80-D81-D82>0,D79-D80-D81-D82,0)","v":0},{"$f":"IF(AND(D82>0,B82>0),B82-B79+1,0)","v":0},{"$f":"IF(H82>0,IF(H82>Faktoren!$D$5,Faktoren!$E$4,Faktoren!$E$5),0)","v":0},{"$f":"IF(H82>0,D82*I82,0)","v":0},null,null,{"$f":"IF(OR(B82=\"\",D82=\"\"),0,H82+(I$6-B82))","v":0},{"$f":"IF(D82=\"\",0,VLOOKUP(M82,Faktoren!$B$16:$D$55,2)/1000)","v":0},null,null,null,{"$f":"IF(AND(H82 > 0, B82 > 0), LOOKUP(H82,INDEX(Faktoren!data,,1),INDEX(Faktoren!data,,5)),0)","v":0},0]
[null,null,"",null,{"$f":"Textes!A307","v":"4e abattage"},null,{"$f":"IF(D79-D80-D81-D82-D83>0,D79-D80-D81-D82-D83,0)","v":0},{"$f":"IF(AND(D83>0,B83>0),B83-B79+1,0)","v":0},{"$f":"IF(H83>0,IF(H83>Faktoren!$D$5,Faktoren!$E$4,Faktoren!$E$5),0)","v":0},{"$f":"IF(H83>0,D83*I83,0)","v":0},null,null,{"$f":"IF(OR(B83=\"\",D83=\"\"),0,H83+(I$6-B83))","v":0},{"$f":"IF(D83=\"\",0,VLOOKUP(M83,Faktoren!$B$16:$D$55,2)/1000)","v":0},null,null,null,{"$f":"IF(AND(H83 > 0, B83 > 0), LOOKUP(H83,INDEX(Faktoren!data,,1),INDEX(Faktoren!data,,5)),0)","v":0},0]
[null,null,"",null,{"$f":"Textes!A308","v":"5e abattage"},null,{"$f":"IF(D79-D80-D81-D82-D83-D84>0,D79-D80-D81-D82-D83-D84,0)","v":0},{"$f":"IF(AND(D84>0,B84>0),B84-B79+1,0)","v":0},{"$f":"IF(H84>0,IF(H84>Faktoren!$D$5,Faktoren!$E$4,Faktoren!$E$5),0)","v":0},{"$f":"IF(H84>0,D84*I84,0)","v":0},null,null,{"$f":"IF(OR(B84=\"\",D84=\"\"),0,H84+(I$6-B84))","v":0},{"$f":"IF(D84=\"\",0,VLOOKUP(M84,Faktoren!$B$16:$D$55,2)/1000)","v":0},null,null,null,{"$f":"IF(AND(H84 > 0, B84 > 0), LOOKUP(H84,INDEX(Faktoren!data,,1),INDEX(Faktoren!data,,5)),0)","v":0},0]
[null,{"$f":"IF(SUM(B79:B84) > 0,E85,\"\")","v":""},null,{"$f":"+D79-SUM(D80:D84)","v":0},{"$f":"Textes!A309","v":"pertes"},{"$f":"D85*0.6","v":0},null,null,{"$f":"IF(D85>0,Faktoren!$E$7,0)","v":0},{"$f":"IF(D85>0,D85*I85,0)","v":0},{"$f":"SUM(J80:J85)","v":0},null,{"$f":"IF(MAX(B79:B84)<$I$6,0,VLOOKUP($I$6,B79:G84,6))","v":0},null,{"$f":"MAX(B79:B84)","v":"00:00:00"},{"$f":"IF(OR($F$6=\"\",I$6=\"\",O85<F$6),99,IF(AND(O85>F$6,O85<=I$6),0,1))","v":99},null,{"$f":"IF(AND(H85 > 0, B85 > 0), LOOKUP(H85,INDEX(Faktoren!data,,1),INDEX(Faktoren!data,,5)),0)","v":0},0,{"$f":"SUM(S79:S85)","v":0}]
[null,null,null,{"$f":"IF(D79>0,ROUND(+D85/D79*100,1),0)","v":0},{"$f":"Textes!A310","v":"pertes en %"},null,"belegt",{"$f":"MAX(H79:H84)","v":0},{"$f":"Textes!A312","v":"jours poulailler occupé"},null,null,null,null,{"$f":"IF(P85=1,$I$6-B79+1,H86)","v":0}]
[null,null,null,{"$f":"IF(P85=99,0,IF(P85=0,H86/MAX(H80:H84),IF(P85=1,(H86-(O85-$I$6))/H86,0)))","v":0},{"$f":"Textes!A311","v":"Rotations"},null,null,{"$f":"IF(B89<>0,(B89-O85),0)","v":0},{"$f":"Textes!A313","v":"jours poulailler inoccupé"}]
[null,{"$f":"Textes!A298","v":"Rotation 8"}]
[null,null,{"$f":"IF(ISERROR(Jahr), \"\", IF($F$6>B89,\"\",IF(B89>$I$6,Jahr + 1,Jahr)))","v":""},null,{"$f":"Textes!A303","v":"Mise en poulailler"},{"$f":"D89*0.04","v":0},{"$f":"IF(D89>0,D89,0)","v":0},null,null,null,null,null,{"$f":"IF(OR(B89=\"\",D89=\"\"),0,IF((I$6-B89)=0,1,H89+(I$6-B89)))","v":0},{"$f":"IF(D89=\"\",0,VLOOKUP(M89,Faktoren!$B$16:$D$55,2)/1000)","v":0},null,null,null,{"$f":"IF(AND(H89 > 0, B89 > 0), LOOKUP(H89,INDEX(Faktoren!data,,1),INDEX(Faktoren!data,,5)),0)","v":0},{"$f":"D89:D95 * R89:R95","v":0}]
[null,null,"",null,{"$f":"Textes!A304","v":"1er abattage"},null,{"$f":"IF(D89-D90>0,D89-D90,0)","v":0},{"$f":"IF(AND(D90>0,B90>0),B90-B89+1,0)","v":0},{"$f":"IF(H90>0,IF(H90>Faktoren!$D$5,Faktoren!$E$4,Faktoren!$E$5),0)","v":0},{"$f":"IF(H90>0,D90*I90,0)","v":0},null,null,{"$f":"IF(OR(B90=\"\",D90=\"\"),0,H90+(I$6-B90))","v":0},{"$f":"IF(D90=\"\",0,VLOOKUP(M90,Faktoren!$B$16:$D$55,2)/1000)","v":0},null,null,null,{"$f":"IF(AND(H90 > 0, B90 > 0), LOOKUP(H90,INDEX(Faktoren!data,,1),INDEX(Faktoren!data,,5)),0)","v":0},0]
[null,null,"",null,{"$f":"Textes!A305","v":"2e abattage"},null,{"$f":"IF(D89-D90-D91>0,D89-D90-D91,0)","v":0},{"$f":"IF(AND(D91>0,B91>0),B91-B89+1,0)","v":0},{"$f":"IF(H91>0,IF(H91>Faktoren!$D$5,Faktoren!$E$4,Faktoren!$E$5),0)","v":0},{"$f":"IF(H91>0,D91*I91,0)","v":0},null,null,{"$f":"IF(OR(B91=\"\",D91=\"\"),0,H91+(I$6-B91))","v":0},{"$f":"IF(D91=\"\",0,VLOOKUP(M91,Faktoren!$B$16:$D$55,2)/1000)","v":0},null,null,null,{"$f":"IF(AND(H91 > 0, B91 > 0), LOOKUP(H91,INDEX(Faktoren!data,,1),INDEX(Faktoren!data,,5)),0)","v":0},0]
[null,null,"",null,{"$f":"Textes!A306","v":"3e abattage"},null,{"$f":"IF(D89-D90-D91-D92>0,D89-D90-D91-D92,0)","v":0},{"$f":"IF(AND(D92>0,B92>0),B92-B89+1,0)","v":0},{"$f":"IF(H92>0,IF(H92>Faktoren!$D$5,Faktoren!$E$4,Faktoren!$E$5),0)","v":0},{"$f":"IF(H92>0,D92*I92,0)","v":0},null,null,{"$f":"IF(OR(B92=\"\",D92=\"\"),0,H92+(I$6-B92))","v":0},{"$f":"IF(D92=\"\",0,VLOOKUP(M92,Faktoren!$B$16:$D$55,2)/1000)","v":0},null,null,null,{"$f":"IF(AND(H92 > 0, B92 > 0), LOOKUP(H92,INDEX(Faktoren!data,,1),INDEX(Faktoren!data,,5)),0)","v":0},0]
[null,null,"",null,{"$f":"Textes!A307","v":"4e abattage"},null,{"$f":"IF(D89-D90-D91-D92-D93>0,D89-D90-D91-D92-D93,0)","v":0},{"$f":"IF(AND(D93>0,B93>0),B93-B89+1,0)","v":0},{"$f":"IF(H93>0,IF(H93>Faktoren!$D$5,Faktoren!$E$4,Faktoren!$E$5),0)","v":0},{"$f":"IF(H93>0,D93*I93,0)","v":0},null,null,{"$f":"IF(OR(B93=\"\",D93=\"\"),0,H93+(I$6-B93))","v":0},{"$f":"IF(D93=\"\",0,VLOOKUP(M93,Faktoren!$B$16:$D$55,2)/1000)","v":0},null,null,null,{"$f":"IF(AND(H93 > 0, B93 > 0), LOOKUP(H93,INDEX(Faktoren!data,,1),INDEX(Faktoren!data,,5)),0)","v":0},0]
[null,null,"",null,{"$f":"Textes!A308","v":"5e abattage"},null,{"$f":"IF(D89-D90-D91-D92-D93-D94>0,D89-D90-D91-D92-D93-D94,0)","v":0},{"$f":"IF(AND(D94>0,B94>0),B94-B89+1,0)","v":0},{"$f":"IF(H94>0,IF(H94>Faktoren!$D$5,Faktoren!$E$4,Faktoren!$E$5),0)","v":0},{"$f":"IF(H94>0,D94*I94,0)","v":0},null,null,{"$f":"IF(OR(B94=\"\",D94=\"\"),0,H94+(I$6-B94))","v":0},{"$f":"IF(D94=\"\",0,VLOOKUP(M94,Faktoren!$B$16:$D$55,2)/1000)","v":0},null,null,null,{"$f":"IF(AND(H94 > 0, B94 > 0), LOOKUP(H94,INDEX(Faktoren!data,,1),INDEX(Faktoren!data,,5)),0)","v":0},0]
[null,{"$f":"IF(SUM(B89:B94) > 0,E95,\"\")","v":""},null,{"$f":"+D89-SUM(D90:D94)","v":0},{"$f":"Textes!A309","v":"pertes"},{"$f":"D95*0.6","v":0},null,null,{"$f":"IF(D95>0,Faktoren!$E$7,0)","v":0},{"$f":"IF(D95>0,D95*I95,0)","v":0},{"$f":"SUM(J90:J95)","v":0},null,{"$f":"IF(MAX(B89:B94)<$I$6,0,VLOOKUP($I$6,B89:G94,6))","v":0},null,{"$f":"MAX(B89:B94)","v":"00:00:00"},{"$f":"IF(OR($F$6=\"\",I$6=\"\",O95<F$6),99,IF(AND(O95>F$6,O95<=I$6),0,1))","v":99},null,{"$f":"IF(AND(H95 > 0, B95 > 0), LOOKUP(H95,INDEX(Faktoren!data,,1),INDEX(Faktoren!data,,5)),0)","v":0},0,{"$f":"SUM(S89:S95)","v":0}]
[null,null,null,{"$f":"IF(D89>0,ROUND(+D95/D89*100,1),0)","v":0},{"$f":"Textes!A310","v":"pertes en %"},null,"belegt",{"$f":"MAX(H89:H94)","v":0},{"$f":"Textes!A312","v":"jours poulailler occupé"},null,null,null,null,{"$f":"IF(P95=1,$I$6-B89+1,H96)","v":0}]
[null,null,null,{"$f":"IF(P95=99,0,IF(P95=0,H96/MAX(H90:H94),IF(P95=1,(H96-(O95-$I$6))/H96,0)))","v":0},{"$f":"Textes!A311","v":"Rotations"},null,null,{"$f":"IF(B99<>0,(B99-O95),0)","v":0},{"$f":"Textes!A313","v":"jours poulailler inoccupé"}]
[null,{"$f":"Textes!A299","v":"Rotation 9"}]
[null,null,{"$f":"IF(ISERROR(Jahr), \"\", IF($F$6>B99,\"\",IF(B99>$I$6,Jahr + 1,Jahr)))","v":""},null,{"$f":"Textes!A303","v":"Mise en poulailler"},{"$f":"D99*0.04","v":0},{"$f":"IF(D99>0,D99,0)","v":0},null,null,null,null,null,{"$f":"IF(OR(B99=\"\",D99=\"\"),0,IF((I$6-B99)=0,1,H99+(I$6-B99)))","v":0},{"$f":"IF(D99=\"\",0,VLOOKUP(M99,Faktoren!$B$16:$D$55,2)/1000)","v":0},null,null,null,{"$f":"IF(AND(H99 > 0, B99 > 0), LOOKUP(H99,INDEX(Faktoren!data,,1),INDEX(Faktoren!data,,5)),0)","v":0},{"$f":"D99:D105 * R99:R105","v":0}]
[null,null,"",null,{"$f":"Textes!A304","v":"1er abattage"},null,{"$f":"IF(D99-D100>0,D99-D100,0)","v":0},{"$f":"IF(AND(D100>0,B100>0),B100-B99+1,0)","v":0},{"$f":"IF(H100>0,IF(H100>Faktoren!$D$5,Faktoren!$E$4,Faktoren!$E$5),0)","v":0},{"$f":"IF(H100>0,D100*I100,0)","v":0},null,null,{"$f":"IF(OR(B100=\"\",D100=\"\"),0,H100+(I$6-B100))","v":0},{"$f":"IF(D100=\"\",0,VLOOKUP(M100,Faktoren!$B$16:$D$55,2)/1000)","v":0},null,null,null,{"$f":"IF(AND(H100 > 0, B100 > 0), LOOKUP(H100,INDEX(Faktoren!data,,1),INDEX(Faktoren!data,,5)),0)","v":0},0]
[null,null,"",null,{"$f":"Textes!A305","v":"2e abattage"},null,{"$f":"IF(D99-D100-D101>0,D99-D100-D101,0)","v":0},{"$f":"IF(AND(D101>0,B101>0),B101-B99+1,0)","v":0},{"$f":"IF(H101>0,IF(H101>Faktoren!$D$5,Faktoren!$E$4,Faktoren!$E$5),0)","v":0},{"$f":"IF(H101>0,D101*I101,0)","v":0},null,null,{"$f":"IF(OR(B101=\"\",D101=\"\"),0,H101+(I$6-B101))","v":0},{"$f":"IF(D101=\"\",0,VLOOKUP(M101,Faktoren!$B$16:$D$55,2)/1000)","v":0},null,null,null,{"$f":"IF(AND(H101 > 0, B101 > 0), LOOKUP(H101,INDEX(Faktoren!data,,1),INDEX(Faktoren!data,,5)),0)","v":0},0]
[null,null,"",null,{"$f":"Textes!A306","v":"3e abattage"},null,{"$f":"IF(D99-D100-D101-D102>0,D99-D100-D101-D102,0)","v":0},{"$f":"IF(AND(D102>0,B102>0),B102-B99+1,0)","v":0},{"$f":"IF(H102>0,IF(H102>Faktoren!$D$5,Faktoren!$E$4,Faktoren!$E$5),0)","v":0},{"$f":"IF(H102>0,D102*I102,0)","v":0},null,null,{"$f":"IF(OR(B102=\"\",D102=\"\"),0,H102+(I$6-B102))","v":0},{"$f":"IF(D102=\"\",0,VLOOKUP(M102,Faktoren!$B$16:$D$55,2)/1000)","v":0},null,null,null,{"$f":"IF(AND(H102 > 0, B102 > 0), LOOKUP(H102,INDEX(Faktoren!data,,1),INDEX(Faktoren!data,,5)),0)","v":0},0]
[null,null,"",null,{"$f":"Textes!A307","v":"4e abattage"},null,{"$f":"IF(D99-D100-D101-D102-D103>0,D99-D100-D101-D102-D103,0)","v":0},{"$f":"IF(AND(D103>0,B103>0),B103-B99+1,0)","v":0},{"$f":"IF(H103>0,IF(H103>Faktoren!$D$5,Faktoren!$E$4,Faktoren!$E$5),0)","v":0},{"$f":"IF(H103>0,D103*I103,0)","v":0},null,null,{"$f":"IF(OR(B103=\"\",D103=\"\"),0,H103+(I$6-B103))","v":0},{"$f":"IF(D103=\"\",0,VLOOKUP(M103,Faktoren!$B$16:$D$55,2)/1000)","v":0},null,null,null,{"$f":"IF(AND(H103 > 0, B103 > 0), LOOKUP(H103,INDEX(Faktoren!data,,1),INDEX(Faktoren!data,,5)),0)","v":0},0]
[null,null,"",null,{"$f":"Textes!A308","v":"5e abattage"},null,{"$f":"IF(D99-D100-D101-D102-D103-D104>0,D99-D100-D101-D102-D103-D104,0)","v":0},{"$f":"IF(AND(D104>0,B104>0),B104-B99+1,0)","v":0},{"$f":"IF(H104>0,IF(H104>Faktoren!$D$5,Faktoren!$E$4,Faktoren!$E$5),0)","v":0},{"$f":"IF(H104>0,D104*I104,0)","v":0},null,null,{"$f":"IF(OR(B104=\"\",D104=\"\"),0,H104+(I$6-B104))","v":0},{"$f":"IF(D104=\"\",0,VLOOKUP(M104,Faktoren!$B$16:$D$55,2)/1000)","v":0},null,null,null,{"$f":"IF(AND(H104 > 0, B104 > 0), LOOKUP(H104,INDEX(Faktoren!data,,1),INDEX(Faktoren!data,,5)),0)","v":0},0]
[null,{"$f":"IF(SUM(B99:B104) > 0,E105,\"\")","v":""},null,{"$f":"+D99-SUM(D100:D104)","v":0},{"$f":"Textes!A309","v":"pertes"},{"$f":"D105*0.6","v":0},null,null,{"$f":"IF(D105>0,Faktoren!$E$7,0)","v":0},{"$f":"IF(D105>0,D105*I105,0)","v":0},{"$f":"SUM(J100:J105)","v":0},null,{"$f":"IF(MAX(B99:B104)<$I$6,0,VLOOKUP($I$6,B99:G104,6))","v":0},null,{"$f":"MAX(B99:B104)","v":"00:00:00"},{"$f":"IF(OR($F$6=\"\",I$6=\"\",O105<F$6),99,IF(AND(O105>F$6,O105<=I$6),0,1))","v":99},null,{"$f":"IF(AND(H105 > 0, B105 > 0), LOOKUP(H105,INDEX(Faktoren!data,,1),INDEX(Faktoren!data,,5)),0)","v":0},0,{"$f":"SUM(S99:S105)","v":0}]
[null,null,null,{"$f":"IF(D99>0,ROUND(+D105/D99*100,1),0)","v":0},{"$f":"Textes!A310","v":"pertes en %"},null,"belegt",{"$f":"MAX(H99:H104)","v":0},{"$f":"Textes!A312","v":"jours poulailler occupé"},null,null,null,null,{"$f":"IF(P105=1,$I$6-B99+1,H106)","v":0}]
[null,null,null,{"$f":"IF(P105=99,0,IF(P105=0,H106/MAX(H100:H104),IF(P105=1,(H106-(O105-$I$6))/H106,0)))","v":0},{"$f":"Textes!A311","v":"Rotations"},null,null,{"$f":"IF(B109<>0,(B109-O105),0)","v":0},{"$f":"Textes!A313","v":"jours poulailler inoccupé"}]
[null,{"$f":"Textes!A300","v":"Rotation 10"}]
[null,null,{"$f":"IF(ISERROR(Jahr), \"\", IF($F$6>B109,\"\",IF(B109>$I$6,Jahr + 1,Jahr)))","v":""},null,{"$f":"Textes!A303","v":"Mise en poulailler"},{"$f":"D109*0.04","v":0},{"$f":"IF(D109>0,D109,0)","v":0},null,null,null,null,null,{"$f":"IF(OR(B109=\"\",D109=\"\"),0,IF((I$6-B109)=0,1,H109+(I$6-B109)))","v":0},{"$f":"IF(D109=\"\",0,VLOOKUP(M109,Faktoren!$B$16:$D$55,2)/1000)","v":0},null,null,null,{"$f":"IF(AND(H109 > 0, B109 > 0), LOOKUP(H109,INDEX(Faktoren!data,,1),INDEX(Faktoren!data,,5)),0)","v":0},{"$f":"D109:D115 * R109:R115","v":0}]
[null,null,"",null,{"$f":"Textes!A304","v":"1er abattage"},null,{"$f":"IF(D109-D110>0,D109-D110,0)","v":0},{"$f":"IF(AND(D110>0,B110>0),B110-B109+1,0)","v":0},{"$f":"IF(H110>0,IF(H110>Faktoren!$D$5,Faktoren!$E$4,Faktoren!$E$5),0)","v":0},{"$f":"IF(H110>0,D110*I110,0)","v":0},null,null,{"$f":"IF(OR(B110=\"\",D110=\"\"),0,H110+(I$6-B110))","v":0},{"$f":"IF(D110=\"\",0,VLOOKUP(M110,Faktoren!$B$16:$D$55,2)/1000)","v":0},null,null,null,{"$f":"IF(AND(H110 > 0, B110 > 0), LOOKUP(H110,INDEX(Faktoren!data,,1),INDEX(Faktoren!data,,5)),0)","v":0},0]
[null,null,"",null,{"$f":"Textes!A305","v":"2e abattage"},null,{"$f":"IF(D109-D110-D111>0,D109-D110-D111,0)","v":0},{"$f":"IF(AND(D111>0,B111>0),B111-B109+1,0)","v":0},{"$f":"IF(H111>0,IF(H111>Faktoren!$D$5,Faktoren!$E$4,Faktoren!$E$5),0)","v":0},{"$f":"IF(H111>0,D111*I111,0)","v":0},null,null,{"$f":"IF(OR(B111=\"\",D111=\"\"),0,H111+(I$6-B111))","v":0},{"$f":"IF(D111=\"\",0,VLOOKUP(M111,Faktoren!$B$16:$D$55,2)/1000)","v":0},null,null,null,{"$f":"IF(AND(H111 > 0, B111 > 0), LOOKUP(H111,INDEX(Faktoren!data,,1),INDEX(Faktoren!data,,5)),0)","v":0},0]
[null,null,"",null,{"$f":"Textes!A306","v":"3e abattage"},null,{"$f":"IF(D109-D110-D111-D112>0,D109-D110-D111-D112,0)","v":0},{"$f":"IF(AND(D112>0,B112>0),B112-B109+1,0)","v":0},{"$f":"IF(H112>0,IF(H112>Faktoren!$D$5,Faktoren!$E$4,Faktoren!$E$5),0)","v":0},{"$f":"IF(H112>0,D112*I112,0)","v":0},null,null,{"$f":"IF(OR(B112=\"\",D112=\"\"),0,H112+(I$6-B112))","v":0},{"$f":"IF(D112=\"\",0,VLOOKUP(M112,Faktoren!$B$16:$D$55,2)/1000)","v":0},null,null,null,{"$f":"IF(AND(H112 > 0, B112 > 0), LOOKUP(H112,INDEX(Faktoren!data,,1),INDEX(Faktoren!data,,5)),0)","v":0},0]
[null,null,"",null,{"$f":"Textes!A307","v":"4e abattage"},null,{"$f":"IF(D109-D110-D111-D112-D113>0,D109-D110-D111-D112-D113,0)","v":0},{"$f":"IF(AND(D113>0,B113>0),B113-B109+1,0)","v":0},{"$f":"IF(H113>0,IF(H113>Faktoren!$D$5,Faktoren!$E$4,Faktoren!$E$5),0)","v":0},{"$f":"IF(H113>0,D113*I113,0)","v":0},null,null,{"$f":"IF(OR(B113=\"\",D113=\"\"),0,H113+(I$6-B113))","v":0},{"$f":"IF(D113=\"\",0,VLOOKUP(M113,Faktoren!$B$16:$D$55,2)/1000)","v":0},null,null,null,{"$f":"IF(AND(H113 > 0, B113 > 0), LOOKUP(H113,INDEX(Faktoren!data,,1),INDEX(Faktoren!data,,5)),0)","v":0},0]
[null,null,"",null,{"$f":"Textes!A308","v":"5e abattage"},null,{"$f":"IF(D109-D110-D111-D112-D113-D114>0,D109-D110-D111-D112-D113-D114,0)","v":0},{"$f":"IF(AND(D114>0,B114>0),B114-B109+1,0)","v":0},{"$f":"IF(H114>0,IF(H114>Faktoren!$D$5,Faktoren!$E$4,Faktoren!$E$5),0)","v":0},{"$f":"IF(H114>0,D114*I114,0)","v":0},null,null,{"$f":"IF(OR(B114=\"\",D114=\"\"),0,H114+(I$6-B114))","v":0},{"$f":"IF(D114=\"\",0,VLOOKUP(M114,Faktoren!$B$16:$D$55,2)/1000)","v":0},null,null,null,{"$f":"IF(AND(H114 > 0, B114 > 0), LOOKUP(H114,INDEX(Faktoren!data,,1),INDEX(Faktoren!data,,5)),0)","v":0},0]
[null,{"$f":"IF(SUM(B109:B114) > 0,E115,\"\")","v":""},null,{"$f":"+D109-SUM(D110:D114)","v":0},{"$f":"Textes!A309","v":"pertes"},{"$f":"D115*0.6","v":0},null,null,{"$f":"IF(D115>0,Faktoren!$E$7,0)","v":0},{"$f":"IF(D115>0,D115*I115,0)","v":0},{"$f":"SUM(J110:J115)","v":0},null,{"$f":"IF(MAX(B109:B114)<$I$6,0,VLOOKUP($I$6,B109:G114,6))","v":0},null,{"$f":"MAX(B109:B114)","v":"00:00:00"},{"$f":"IF(OR($F$6=\"\",I$6=\"\",O115<F$6),99,IF(AND(O115>F$6,O115<=I$6),0,1))","v":99},null,{"$f":"IF(AND(H115 > 0, B115 > 0), LOOKUP(H115,INDEX(Faktoren!data,,1),INDEX(Faktoren!data,,5)),0)","v":0},0,{"$f":"SUM(S109:S115)","v":0}]
[null,null,null,{"$f":"IF(D109>0,ROUND(+D115/D109*100,1),0)","v":0},{"$f":"Textes!A310","v":"pertes en %"},null,"belegt",{"$f":"MAX(H109:H114)","v":0},{"$f":"Textes!A312","v":"jours poulailler occupé"},null,null,null,null,{"$f":"IF(P115=1,$I$6-B109+1,H116)","v":0}]
[null,null,null,{"$f":"IF(P115=99,0,IF(P115=0,H116/MAX(H110:H114),IF(P115=1,(H116-(O115-$I$6))/H116,0)))","v":0},{"$f":"Textes!A311","v":"Rotations"},null,null,{"$f":"IF(B119<>0,(B119-O115),0)","v":0},{"$f":"Textes!A313","v":"jours poulailler inoccupé"}]
[null,{"$f":"Textes!A301","v":"Rotation 11"}]
[null,null,{"$f":"IF(ISERROR(Jahr), \"\", IF($F$6>B119,\"\",IF(B119>$I$6,Jahr + 1,Jahr)))","v":""},null,{"$f":"Textes!A303","v":"Mise en poulailler"},{"$f":"D119*0.04","v":0},{"$f":"IF(D119>0,D119,0)","v":0},null,null,null,null,null,{"$f":"IF(OR(B119=\"\",D119=\"\"),0,IF((I$6-B119)=0,1,H119+(I$6-B119)))","v":0},{"$f":"IF(D119=\"\",0,VLOOKUP(M119,Faktoren!$B$16:$D$55,2)/1000)","v":0},null,null,null,{"$f":"IF(AND(H119 > 0, B119 > 0), LOOKUP(H119,INDEX(Faktoren!data,,1),INDEX(Faktoren!data,,5)),0)","v":0},{"$f":"D119:D125 * R119:R125","v":0}]
[null,null,"",null,{"$f":"Textes!A304","v":"1er abattage"},null,{"$f":"IF(D119-D120>0,D119-D120,0)","v":0},{"$f":"IF(AND(D120>0,B120>0),B120-B119+1,0)","v":0},{"$f":"IF(H120>0,IF(H120>Faktoren!$D$5,Faktoren!$E$4,Faktoren!$E$5),0)","v":0},{"$f":"IF(H120>0,D120*I120,0)","v":0},null,null,{"$f":"IF(OR(B120=\"\",D120=\"\"),0,H120+(I$6-B120))","v":0},{"$f":"IF(D120=\"\",0,VLOOKUP(M120,Faktoren!$B$16:$D$55,2)/1000)","v":0},null,null,null,{"$f":"IF(AND(H120 > 0, B120 > 0), LOOKUP(H120,INDEX(Faktoren!data,,1),INDEX(Faktoren!data,,5)),0)","v":0},0]
[null,null,"",null,{"$f":"Textes!A305","v":"2e abattage"},null,{"$f":"IF(D119-D120-D121>0,D119-D120-D121,0)","v":0},{"$f":"IF(AND(D121>0,B121>0),B121-B119+1,0)","v":0},{"$f":"IF(H121>0,IF(H121>Faktoren!$D$5,Faktoren!$E$4,Faktoren!$E$5),0)","v":0},{"$f":"IF(H121>0,D121*I121,0)","v":0},null,null,{"$f":"IF(OR(B121=\"\",D121=\"\"),0,H121+(I$6-B121))","v":0},{"$f":"IF(D121=\"\",0,VLOOKUP(M121,Faktoren!$B$16:$D$55,2)/1000)","v":0},null,null,null,{"$f":"IF(AND(H121 > 0, B121 > 0), LOOKUP(H121,INDEX(Faktoren!data,,1),INDEX(Faktoren!data,,5)),0)","v":0},0]
[null,null,"",null,{"$f":"Textes!A306","v":"3e abattage"},null,{"$f":"IF(D119-D120-D121-D122>0,D119-D120-D121-D122,0)","v":0},{"$f":"IF(AND(D122>0,B122>0),B122-B119+1,0)","v":0},{"$f":"IF(H122>0,IF(H122>Faktoren!$D$5,Faktoren!$E$4,Faktoren!$E$5),0)","v":0},{"$f":"IF(H122>0,D122*I122,0)","v":0},null,null,{"$f":"IF(OR(B122=\"\",D122=\"\"),0,H122+(I$6-B122))","v":0},{"$f":"IF(D122=\"\",0,VLOOKUP(M122,Faktoren!$B$16:$D$55,2)/1000)","v":0},null,null,null,{"$f":"IF(AND(H122 > 0, B122 > 0), LOOKUP(H122,INDEX(Faktoren!data,,1),INDEX(Faktoren!data,,5)),0)","v":0},0]
[null,null,"",null,{"$f":"Textes!A307","v":"4e abattage"},null,{"$f":"IF(D119-D120-D121-D122-D123>0,D119-D120-D121-D122-D123,0)","v":0},{"$f":"IF(AND(D123>0,B123>0),B123-B119+1,0)","v":0},{"$f":"IF(H123>0,IF(H123>Faktoren!$D$5,Faktoren!$E$4,Faktoren!$E$5),0)","v":0},{"$f":"IF(H123>0,D123*I123,0)","v":0},null,null,{"$f":"IF(OR(B123=\"\",D123=\"\"),0,H123+(I$6-B123))","v":0},{"$f":"IF(D123=\"\",0,VLOOKUP(M123,Faktoren!$B$16:$D$55,2)/1000)","v":0},null,null,null,{"$f":"IF(AND(H123 > 0, B123 > 0), LOOKUP(H123,INDEX(Faktoren!data,,1),INDEX(Faktoren!data,,5)),0)","v":0},0]
[null,null,"",null,{"$f":"Textes!A308","v":"5e abattage"},null,{"$f":"IF(D119-D120-D121-D122-D123-D124>0,D119-D120-D121-D122-D123-D124,0)","v":0},{"$f":"IF(AND(D124>0,B124>0),B124-B119+1,0)","v":0},{"$f":"IF(H124>0,IF(H124>Faktoren!$D$5,Faktoren!$E$4,Faktoren!$E$5),0)","v":0},{"$f":"IF(H124>0,D124*I124,0)","v":0},null,null,{"$f":"IF(OR(B124=\"\",D124=\"\"),0,H124+(I$6-B124))","v":0},{"$f":"IF(D124=\"\",0,VLOOKUP(M124,Faktoren!$B$16:$D$55,2)/1000)","v":0},null,null,null,{"$f":"IF(AND(H124 > 0, B124 > 0), LOOKUP(H124,INDEX(Faktoren!data,,1),INDEX(Faktoren!data,,5)),0)","v":0},0]
[null,{"$f":"IF(SUM(B119:B124) > 0,E125,\"\")","v":""},null,{"$f":"+D119-SUM(D120:D124)","v":0},{"$f":"Textes!A309","v":"pertes"},{"$f":"D125*0.6","v":0},null,null,{"$f":"IF(D125>0,Faktoren!$E$7,0)","v":0},{"$f":"IF(D125>0,D125*I125,0)","v":0},{"$f":"SUM(J120:J125)","v":0},null,{"$f":"IF(MAX(B119:B124)<$I$6,0,VLOOKUP($I$6,B119:G124,6))","v":0},null,{"$f":"MAX(B119:B124)","v":"00:00:00"},{"$f":"IF(OR($F$6=\"\",I$6=\"\",O125<F$6),99,IF(AND(O125>F$6,O125<=I$6),0,1))","v":99},null,{"$f":"IF(AND(H125 > 0, B125 > 0), LOOKUP(H125,INDEX(Faktoren!data,,1),INDEX(Faktoren!data,,5)),0)","v":0},0,{"$f":"SUM(S119:S125)","v":0}]
[null,null,null,{"$f":"IF(D119>0,ROUND(+D125/D119*100,1),0)","v":0},{"$f":"Textes!A310","v":"pertes en %"},null,"belegt",{"$f":"MAX(H119:H124)","v":0},{"$f":"Textes!A312","v":"jours poulailler occupé"},null,null,null,null,{"$f":"IF(P125=1,$I$6-B119+1,H126)","v":0}]
[null,null,null,{"$f":"IF(P125=99,0,IF(P125=0,H126/MAX(H120:H124),IF(P125=1,(H126-(O125-$I$6))/H126,0)))","v":0},{"$f":"Textes!A311","v":"Rotations"},null,null,{"$f":"IF(B131<>0,(B131-O125),0)","v":0},{"$f":"Textes!A313","v":"jours poulailler inoccupé"}]
[]
[null,{"$f":"Textes!A268","v":"Poulailler 2"},null,null,null,null,null,null,null,null,{"$f":"Textes!A339","v":"page 3"}]
[null,{"$f":"Textes!A302","v":"Rotation 12"}]
[null,null,{"$f":"IF(ISERROR(Jahr), \"\", IF($F$6>B131,\"\",IF(B131>$I$6,Jahr + 1,Jahr)))","v":""},null,{"$f":"Textes!A303","v":"Mise en poulailler"},{"$f":"D131*0.04","v":0},{"$f":"IF(D131>0,D131,0)","v":0},null,null,null,null,null,{"$f":"IF(OR(B131=\"\",D131=\"\"),0,IF((I$6-B131)=0,1,H131+(I$6-B131)))","v":0},{"$f":"IF(D131=\"\",0,VLOOKUP(M131,Faktoren!$B$16:$D$55,2)/1000)","v":0},null,null,null,{"$f":"IF(AND(H131 > 0, B131 > 0), LOOKUP(H131,INDEX(Faktoren!data,,1),INDEX(Faktoren!data,,5)),0)","v":0},{"$f":"D131:D137 * R131:R137","v":0}]
[null,null,"",null,{"$f":"Textes!A304","v":"1er abattage"},null,{"$f":"IF(D131-D132>0,D131-D132,0)","v":0},{"$f":"IF(AND(D132>0,B132>0),B132-B131+1,0)","v":0},{"$f":"IF(H132>0,IF(H132>Faktoren!$D$5,Faktoren!$E$4,Faktoren!$E$5),0)","v":0},{"$f":"IF(H132>0,D132*I132,0)","v":0},null,null,{"$f":"IF(OR(B132=\"\",D132=\"\"),0,H132+(I$6-B132))","v":0},{"$f":"IF(D132=\"\",0,VLOOKUP(M132,Faktoren!$B$16:$D$55,2)/1000)","v":0},null,null,null,{"$f":"IF(AND(H132 > 0, B132 > 0), LOOKUP(H132,INDEX(Faktoren!data,,1),INDEX(Faktoren!data,,5)),0)","v":0},0]
[null,null,"",null,{"$f":"Textes!A305","v":"2e abattage"},null,{"$f":"IF(D131-D132-D133>0,D131-D132-D133,0)","v":0},{"$f":"IF(AND(D133>0,B133>0),B133-B131+1,0)","v":0},{"$f":"IF(H133>0,IF(H133>Faktoren!$D$5,Faktoren!$E$4,Faktoren!$E$5),0)","v":0},{"$f":"IF(H133>0,D133*I133,0)","v":0},null,null,{"$f":"IF(OR(B133=\"\",D133=\"\"),0,H133+(I$6-B133))","v":0},{"$f":"IF(D133=\"\",0,VLOOKUP(M133,Faktoren!$B$16:$D$55,2)/1000)","v":0},null,null,null,{"$f":"IF(AND(H133 > 0, B133 > 0), LOOKUP(H133,INDEX(Faktoren!data,,1),INDEX(Faktoren!data,,5)),0)","v":0},0]
[null,null,"",null,{"$f":"Textes!A306","v":"3e abattage"},null,{"$f":"IF(D131-D132-D133-D134>0,D131-D132-D133-D134,0)","v":0},{"$f":"IF(AND(D134>0,B134>0),B134-B131+1,0)","v":0},{"$f":"IF(H134>0,IF(H134>Faktoren!$D$5,Faktoren!$E$4,Faktoren!$E$5),0)","v":0},{"$f":"IF(H134>0,D134*I134,0)","v":0},null,null,{"$f":"IF(OR(B134=\"\",D134=\"\"),0,H134+(I$6-B134))","v":0},{"$f":"IF(D134=\"\",0,VLOOKUP(M134,Faktoren!$B$16:$D$55,2)/1000)","v":0},null,null,null,{"$f":"IF(AND(H134 > 0, B134 > 0), LOOKUP(H134,INDEX(Faktoren!data,,1),INDEX(Faktoren!data,,5)),0)","v":0},0]
[null,null,"",null,{"$f":"Textes!A307","v":"4e abattage"},null,{"$f":"IF(D131-D132-D133-D134-D135>0,D131-D132-D133-D134-D135,0)","v":0},{"$f":"IF(AND(D135>0,B135>0),B135-B131+1,0)","v":0},{"$f":"IF(H135>0,IF(H135>Faktoren!$D$5,Faktoren!$E$4,Faktoren!$E$5),0)","v":0},{"$f":"IF(H135>0,D135*I135,0)","v":0},null,null,{"$f":"IF(OR(B135=\"\",D135=\"\"),0,H135+(I$6-B135))","v":0},{"$f":"IF(D135=\"\",0,VLOOKUP(M135,Faktoren!$B$16:$D$55,2)/1000)","v":0},null,null,null,{"$f":"IF(AND(H135 > 0, B135 > 0), LOOKUP(H135,INDEX(Faktoren!data,,1),INDEX(Faktoren!data,,5)),0)","v":0},0]
[null,null,"",null,{"$f":"Textes!A308","v":"5e abattage"},null,{"$f":"IF(D131-D132-D133-D134-D135-D136>0,D131-D132-D133-D134-D135-D136,0)","v":0},{"$f":"IF(AND(D136>0,B136>0),B136-B131+1,0)","v":0},{"$f":"IF(H136>0,IF(H136>Faktoren!$D$5,Faktoren!$E$4,Faktoren!$E$5),0)","v":0},{"$f":"IF(H136>0,D136*I136,0)","v":0},null,null,{"$f":"IF(OR(B136=\"\",D136=\"\"),0,H136+(I$6-B136))","v":0},{"$f":"IF(D136=\"\",0,VLOOKUP(M136,Faktoren!$B$16:$D$55,2)/1000)","v":0},null,null,null,{"$f":"IF(AND(H136 > 0, B136 > 0), LOOKUP(H136,INDEX(Faktoren!data,,1),INDEX(Faktoren!data,,5)),0)","v":0},0]
[null,{"$f":"IF(SUM(B131:B136) > 0,E137,\"\")","v":""},{"$f":"Jahr+1","v":{"$error":"#VALUE!"}},{"$f":"+D131-D132-D133-D136","v":0},{"$f":"Textes!A309","v":"pertes"},{"$f":"D137*0.6","v":0},null,null,{"$f":"IF(D137>0,Faktoren!$E$7,0)","v":0},{"$f":"IF(D137>0,D137*I137,0)","v":0},{"$f":"SUM(J132:J137)","v":0},null,{"$f":"IF(MAX(B131:B136)<$I$6,0,VLOOKUP($I$6,B131:G136,6))","v":0},null,{"$f":"MAX(B131:B136)","v":"00:00:00"},{"$f":"IF(OR($F$6=\"\",I$6=\"\",O137<F$6),99,IF(AND(O137>F$6,O137<=I$6),0,1))","v":99},null,{"$f":"IF(AND(H137 > 0, B137 > 0), LOOKUP(H137,INDEX(Faktoren!data,,1),INDEX(Faktoren!data,,5)),0)","v":0},0,{"$f":"SUM(S131:S137)","v":0}]
[null,null,null,{"$f":"IF(D131>0,ROUND(+D137/D131*100,1),0)","v":0},{"$f":"Textes!A310","v":"pertes en %"},null,"belegt",{"$f":"MAX(H131:H136)","v":0},{"$f":"Textes!A312","v":"jours poulailler occupé"},null,null,null,null,{"$f":"IF(P137=1,$I$6-B131+1,H138)","v":0}]
[null,null,null,{"$f":"IF(P137=99,0,IF(P137=0,H138/MAX(H132:H136),IF(P137=1,(H138-(O137-$I$6))/H138,0)))","v":0},{"$f":"Textes!A311","v":"Rotations"}]
[]
[null,{"$f":"Poulet1!B141","v":"Effectif moyen"},null,null,null,null,null,null,null,null,null,null,null,null,null,null,null,{"$f":"Poulet1!R141","v":"Effectif moyen"}]
[null,{"$f":"Poulet1!B142","v":"en nombre déterminant"},null,null,null,null,null,null,null,null,{"$f":"IF((K137+K125+K115+K105+K95+K85+K75+K63+K53+K43+K33+K23)>0,(K137+K125+K115+K105+K95+K85+K75+K63+K53+K43+K33+K23)/SUM(G144:G155),0)","v":0},null,null,null,null,null,null,{"$f":"Poulet1!R142","v":"en unités de la période"},null,{"$f":"IF((T137+T125+T115+T105+T95+T85+T75+T63+T53+T43+T33+T23)>0,(T137+T125+T115+T105+T95+T85+T75+T63+T53+T43+T33+T23)/SUM($G$144:$G$155),0)","v":0}]
[]
[null,"Berechnung der Anzahl Umtriebe",null,null,null,null,{"$f":"IF(AND(K23>0,K33>0,K43>0,K53>0,K63>0,K75>0,K85>0,K95>0,K105>0,K115>0,K125>0,K137>0),12,0)","v":0}]
[null,null,null,null,null,null,{"$f":"IF(AND(K23>0,K33>0,K43>0,K53>0,K63>0,K75>0,K85>0,K95>0,K105>0,K115>0,K125>0,K137=0),11,0)","v":0}]
[null,null,null,null,null,null,{"$f":"IF(AND(K23>0,K33>0,K43>0,K53>0,K63>0,K75>0,K85>0,K95>0,K105>0,K115>0,K125=0,K137=0),10,0)","v":0}]
[null,null,null,null,null,null,{"$f":"IF(AND(K23>0,K33>0,K43>0,K53>0,K63>0,K75>0,K85>0,K95>0,K105>0,K115=0,K125=0,K137=0),9,0)","v":0}]
[null,null,null,null,null,null,{"$f":"IF(AND(K23>0,K33>0,K43>0,K53>0,K63>0,K75>0,K85>0,K95>0,K105=0,K115=0,K125=0,K137=0),8,0)","v":0}]
[null,null,null,null,null,null,{"$f":"IF(AND(K23>0,K33>0,K43>0,K53>0,K63>0,K75>0,K85>0,K95=0,K105=0,K115=0,K125=0,K137=0),7,0)","v":0}]
[null,null,null,null,null,null,{"$f":"IF(AND(K23>0,K33>0,K43>0,K53>0,K63>0,K75>0,K85=0,K95=0,K105=0,K115=0,K125=0,K137=0),6,0)","v":0}]
[null,null,null,null,null,null,{"$f":"IF(AND(K23>0,K33>0,K43>0,K53>0,K63>0,K75=0,K85=0,K95=0,K105=0,K115=0,K125=0,K137=0),5,0)","v":0}]
[null,null,null,null,null,null,{"$f":"IF(AND(K23>0,K33>0,K43>0,K53>0,K63=0,K75=0,K85=0,K95=0,K105=0,K115=0,K125=0,K137=0),4,0)","v":0}]
[null,null,null,null,null,null,{"$f":"IF(AND(K23>0,K33>0,K43>0,K53=0,K63=0,K75=0,K85=0,K95=0,K105=0,K115=0,K125=0,K137=0),3,0)","v":0}]
[null,null,null,null,null,null,{"$f":"IF(AND(K23>0,K33>0,K43=0,K53=0,K63=0,K75=0,K85=0,K95=0,K105=0,K115=0,K125=0,K137=0),2,0)","v":0}]
[null,null,null,null,null,null,{"$f":"IF(AND(K23>0,K33=0,K43=0,K53=0,K63=0,K75=0,K85=0,K95=0,K105=0,K115=0,K125=0,K137=0),1,0)","v":0}]
[]
[]
[null,{"$f":"Textes!A317","v":"Nombre de rotations"},null,null,{"$f":"SUM(D25,D35,D45,D55,D65,D77,D87,D97,D107,D117,D127,D139)","v":0}]
[]
[null,{"$f":"Textes!A318","v":"Durée d'occupation"},null,null,{"$f":"IF((H24+H34+H44+H54+H64+H76+H86+H96+H106+H116+H126+H138)>0,(H24+H34+H44+H54+H64+H76+H86+H96+H106+H116+H126+H138)/SUM(G144:G155),0)","v":0},null,null,{"$f":"Textes!A326","v":"(moyenne, sans interruption entre "}]
[null,{"$f":"Textes!A319","v":"par rotation"},null,null,null,null,null,{"$f":"Textes!A327","v":"les rotations)"}]
[]
[null,{"$f":"Textes!A320","v":"Durée d'occupation"},null,"B(eff)",{"$f":"(N24+N34+N44+N54+N64+N76+N86+N96+N106+N116+N126+N138)","v":0},null,null,{"$f":"Textes!A328","v":"(nombre total de jours, sans interruption entre"}]
[null,{"$f":"Textes!A321","v":"totale"},null,null,null,null,null,{"$f":"Textes!A329","v":"les rotations)"}]
[]
[null,{"$f":"Textes!A322","v":"Durée d'occupation"},null,"B(min)",270,null,null,{"$f":"Textes!A330","v":"(durée d'occupation minimale"}]
[null,{"$f":"Textes!A323","v":"minimale par an"},null,null,null,null,null,{"$f":"Textes!A331","v":"pour une utilisation normale du poulailler)"}]
[]
[null,{"$f":"Textes!A324","v":"Durée d'occupation"},null,"B(min)",{"$f":"IF(K6 = \"\",0,E166/365*K6)","v":0},null,null,{"$f":"Textes!A330","v":"(durée d'occupation minimale"}]
[null,{"$f":"Textes!A325","v":"minimale par periode"},null,null,null,null,null,{"$f":"Textes!A332","v":"calculée pour la periode)"}]
[]
[null,null,null,null,null,null,null,null,null,null,null,null,null,null,null,null,null,{"$f":"B141","v":"Effectif moyen"}]
[null,{"$f":"B141 & \" \" & R173","v":"Effectif moyen au poulailler 2"},null,null,null,null,null,null,null,null,{"$f":"IF(E163>=E169,K142,K142/E169*E163)","v":0},null,null,null,null,null,null,{"$f":"Textes!A334","v":"au poulailler 2"},null,{"$f":"IF($E$163>=$E$169,T142,T142/$E$169*$E$163)","v":0}]
[]
[null,{"$f":"Textes!A336","v":"correspond à l'effectif exprimé en UGB"},null,null,null,null,null,null,null,null,{"$f":"K173*Faktoren!E10","v":0}]
[]
[null,{"$f":"+Textes!A73","v":"Organisation de contrôle, Date:"},null,null,null,null,null,{"$f":"+Textes!A88","v":"Signature:"}]
[]
[null,{"$f":"+Textes!A77","v":"Exploitant, Date:"},null,null,null,null,null,{"$f":"+Textes!A88","v":"Signature:"}]

{"sheet":"Poulet3","index":30,"n_rows":179,"n_cols":20,"rows_kept":179,"cut":false,"hidden":true,"merged":[[168,3,169,3],[168,4,169,4],[165,3,166,3],[159,4,160,4],[165,4,166,4],[162,4,163,4],[162,3,163,3]]}
[]
[null,null,null,null,null,null,null,null,null,null,null,{"$f":"Textes!A269","v":"Poulailler 3"}]
[null,{"$f":"Textes!A273","v":"Attention: "}]
[null,{"$f":"Textes!A274","v":"               Travaux commencés avant la période et non terminés pendant la période sont à saisir entièrement !"}]
[]
[null,{"$f":"Textes!A19","v":"Période:"},null,null,{"$f":"Textes!$A$20","v":"Date début:"},{"$f":"IF(Inv!$I$8=0,\"\",Inv!$I$8)","v":""},null,{"$f":"Textes!$A$21","v":"Date fin:"},{"$f":"IF(Inv!$I$9=0,\"\",Inv!$I$9)","v":""},{"$f":"Textes!A22","v":"Durée en jours:"},{"$f":"IF(OR(F6=\"\",I6=\"\"),\"\",I6-F6+1)","v":""}]
[null,null,null,null,null,{"$f":"YEAR(F6)","v":{"$error":"#VALUE!"}}]
[null,{"$f":"+Textes!A9","v":"No cantonal:"},null,null,{"$f":"IF(Inv!D4=0,\"\",Inv!D4)","v":""}]
[null,{"$f":"+Textes!A10","v":"Nom:"},null,null,{"$f":"IF(Inv!D5=0,\"\",Inv!D6 & \" \" & Inv!D5)","v":""}]
[null,{"$f":"+Textes!A13","v":"Adresse:"},null,null,{"$f":"IF(Inv!D7=0,\"\",Inv!D7)","v":""}]
[null,{"$f":"+Textes!A14","v":"NPA, lieu:"},null,null,{"$f":"IF(Inv!D9=0,\"\",Inv!D9)","v":""}]
[]
[null,null,null,null,null,null,null,{"$f":"Textes!A278","v":"Jours "},null,{"$f":"Textes!A282","v":"Nbre d'ani-"},{"$f":"Textes!A285","v":"Nombre déter-"},null,null,null,null,"Erkennen",null,{"$f":"I15","v":"Coefficient"},{"$f":"J13","v":"Nbre d'ani-"},{"$f":"D15","v":"Nombre d'animaux"}]
[null,null,null,null,null,null,"Tier-",{"$f":"Textes!A279","v":"d'engrais-"},null,{"$f":"Textes!A283","v":"maux abattus"},{"$f":"Textes!A286","v":"minant d'animaux"},null,null,null,"Datum ","letzter Umtrieb",null,{"$f":"Textes!A288","v":"pour valeurs"},{"$f":"J14","v":"maux abattus"},{"$f":"K15","v":"par rotation"}]
[null,{"$f":"Textes!A275","v":"Date"},null,{"$f":"Textes!A276","v":"Nombre d'animaux"},null,{"$f":"Textes!A277","v":"kg PV total"},"Bestand",{"$f":"Textes!A280","v":"sement"},{"$f":"Textes!A281","v":"Coefficient"},{"$f":"Textes!A284","v":"x coefficient"},{"$f":"Textes!A287","v":"par rotation"},null,null,null,"(Hilfswert)","für Abgrenzung",null,{"$f":"Textes!A289","v":"minimales (vm)"},"x coefficient",{"$f":"Textes!A290","v":"pour vm"}]
[null,{"$f":"Textes!A291","v":"Rotation 1"},{"$f":"Jahr","v":{"$error":"#VALUE!"}}]
[null,null,{"$f":"IF(ISERROR(Jahr), \"\", IF($F$6>B17,\"\",IF(B17>$I$6,Jahr + 1,Jahr)))","v":""},null,{"$f":"Textes!A303","v":"Mise en poulailler"},{"$f":"D17*0.04","v":0},{"$f":"IF(D17>0,D17,0)","v":0},null,null,null,null,null,{"$f":"IF(OR(B17=\"\",D17=\"\"),0,IF(B17<F$6,H17+(F$6-B17)-1,IF((I$6-B17)=0,1,H17+(I$6-B17))))","v":0},{"$f":"IF(D17=\"\",0,IF(M17=0,VLOOKUP(1,Faktoren!$B$16:$D$55,2)/1000,VLOOKUP(M17,Faktoren!$B$16:$D$55,2)/1000))","v":0},null,null,null,{"$f":"IF(AND(H17 > 0, B17 > 0), LOOKUP(H17,INDEX(Faktoren!data,,1),INDEX(Faktoren!data,,5)),0)","v":0},{"$f":"D17:D23 * R17:R23","v":0}]
[null,null,"",null,{"$f":"Textes!A304","v":"1er abattage"},null,{"$f":"IF(D17-D18>0,D17-D18,0)","v":0},{"$f":"IF(AND(D18>0,B18>0),B18-B17+1,0)","v":0},{"$f":"IF(H18>0,IF(H18>Faktoren!$D$5,Faktoren!$E$4,Faktoren!$E$5),0)","v":0},{"$f":"IF(H18>0,D18*I18,0)","v":0},null,null,{"$f":"IF(OR(B18=\"\",D18=\"\"),0,IF(B18<F$6,H18+(F$6-B18)-1,H18+(I$6-B18)))","v":0},{"$f":"IF(OR(D18=\"\",M18=0),0,VLOOKUP(M18,Faktoren!$B$16:$D$55,2)/1000)","v":0},null,null,null,{"$f":"IF(AND(H18 > 0, B18 > 0), LOOKUP(H18,INDEX(Faktoren!data,,1),INDEX(Faktoren!data,,5)),0)","v":0},0]
[null,null,"",null,{"$f":"Textes!A305","v":"2e abattage"},null,{"$f":"IF(D17-D18-D19>0,D17-D18-D19,0)","v":0},{"$f":"IF(AND(D19>0,B19>0),B19-B17+1,0)","v":0},{"$f":"IF(H19>0,IF(H19>Faktoren!$D$5,Faktoren!$E$4,Faktoren!$E$5),0)","v":0},{"$f":"IF(H19>0,D19*I19,0)","v":0},null,null,{"$f":"IF(OR(B19=\"\",D19=\"\"),0,IF(B19<F$6,H19+(F$6-B19)-1,H19+(I$6-B19)))","v":0},{"$f":"IF(OR(D19=\"\",M19=0),0,VLOOKUP(M19,Faktoren!$B$16:$D$55,2)/1000)","v":0},null,null,null,{"$f":"IF(AND(H19 > 0, B19 > 0), LOOKUP(H19,INDEX(Faktoren!data,,1),INDEX(Faktoren!data,,5)),0)","v":0},0]
[null,null,"",null,{"$f":"Textes!A306","v":"3e abattage"},null,{"$f":"IF(D17-D18-D19-D20>0,D17-D18-D19-D20,0)","v":0},{"$f":"IF(AND(D20>0,B20>0),B20-B17+1,0)","v":0},{"$f":"IF(H20>0,IF(H20>Faktoren!$D$5,Faktoren!$E$4,Faktoren!$E$5),0)","v":0},{"$f":"IF(H20>0,D20*I20,0)","v":0},null,null,{"$f":"IF(OR(B20=\"\",D20=\"\"),0,IF(B20<F$6,H20+(F$6-B20)-1,H20+(I$6-B20)))","v":0},{"$f":"IF(OR(D20=\"\",M20=0),0,VLOOKUP(M20,Faktoren!$B$16:$D$55,2)/1000)","v":0},null,null,null,{"$f":"IF(AND(H20 > 0, B20 > 0), LOOKUP(H20,INDEX(Faktoren!data,,1),INDEX(Faktoren!data,,5)),0)","v":0},0]
[null,null,"",null,{"$f":"Textes!A307","v":"4e abattage"},null,{"$f":"IF(D17-D18-D19-D20-D21>0,D17-D18-D19-D20-D21,0)","v":0},{"$f":"IF(AND(D21>0,B21>0),B21-B17+1,0)","v":0},{"$f":"IF(H21>0,IF(H21>Faktoren!$D$5,Faktoren!$E$4,Faktoren!$E$5),0)","v":0},{"$f":"IF(H21>0,D21*I21,0)","v":0},null,null,{"$f":"IF(OR(B21=\"\",D21=\"\"),0,IF(B21<F$6,H21+(F$6-B21)-1,H21+(I$6-B21)))","v":0},{"$f":"IF(OR(D21=\"\",M21=0),0,VLOOKUP(M21,Faktoren!$B$16:$D$55,2)/1000)","v":0},null,null,null,{"$f":"IF(AND(H21 > 0, B21 > 0), LOOKUP(H21,INDEX(Faktoren!data,,1),INDEX(Faktoren!data,,5)),0)","v":0},0]
[null,null,"",null,{"$f":"Textes!A308","v":"5e abattage"},null,{"$f":"IF(D17-D18-D19-D20-D21-D22>0,D17-D18-D19-D20-D21-D22,0)","v":0},{"$f":"IF(AND(D22>0,B22>0),B22-B17+1,0)","v":0},{"$f":"IF(H22>0,IF(H22>Faktoren!$D$5,Faktoren!$E$4,Faktoren!$E$5),0)","v":0},{"$f":"IF(H22>0,D22*I22,0)","v":0},null,null,{"$f":"IF(OR(B22=\"\",D22=\"\"),0,IF(B22<F$6,H22+(F$6-B22)-1,H22+(I$6-B22)))","v":0},{"$f":"IF(OR(D22=\"\",M22=0),0,VLOOKUP(M22,Faktoren!$B$16:$D$55,2)/1000)","v":0},null,null,null,{"$f":"IF(AND(H22 > 0, B22 > 0), LOOKUP(H22,INDEX(Faktoren!data,,1),INDEX(Faktoren!data,,5)),0)","v":0},0]
[null,{"$f":"IF(SUM(B17:B22) > 0,E23,\"\")","v":""},null,{"$f":"+D17-SUM(D18:D22)","v":0},{"$f":"Textes!A309","v":"pertes"},{"$f":"D23*0.6","v":0},null,null,{"$f":"IF(D23>0,Faktoren!$E$7,0)","v":0},{"$f":"IF(D23>0,D23*I23,0)","v":0},{"$f":"SUM(J18:J23)","v":0},null,{"$f":"IF(B17=F6,G17,IF(MIN(B17:B22)>$F$6,0,VLOOKUP($F$6,B17:G22,6)))","v":0},null,{"$f":"MAX(B17:B22)","v":"00:00:00"},{"$f":"IF(OR($F$6=\"\",I$6=\"\",O23<F$6),99,IF(AND(B17>=F$6,O23<=I$6),0,IF(AND(B17>=F$6,O23>I$6),2,1)))","v":99},null,{"$f":"IF(AND(H23 > 0, B23 > 0), LOOKUP(H23,INDEX(Faktoren!data,,1),INDEX(Faktoren!data,,5)),0)","v":0},0,{"$f":"SUM(S17:S23)","v":0}]
[null,null,null,{"$f":"IF(D17>0,ROUND(+D23/D17*100,1),0)","v":0},{"$f":"Textes!A310","v":"pertes en %"},null,"belegt",{"$f":"MAX(H17:H22)","v":0},{"$f":"Textes!A312","v":"jours poulailler occupé"},null,null,null,null,{"$f":"IF(P23=1,O23-$F$6+1,H24)","v":0}]
[null,null,null,{"$f":"IF(P23=99,0,IF(P23=0,H24/MAX(H18:H22),IF(P23=1,(O23-$F$6)/H24,(H24-(O23-I$6))/H24)))","v":0},{"$f":"Textes!A311","v":"Rotations"},null,null,{"$f":"IF(B27<>0,(B27-O23),0)","v":0},{"$f":"Textes!A313","v":"jours poulailler inoccupé"}]
[null,{"$f":"Textes!A292","v":"Rotation 2"}]
[null,null,{"$f":"IF(ISERROR(Jahr), \"\", IF($F$6>B27,\"\",IF(B27>$I$6,Jahr + 1,Jahr)))","v":""},null,{"$f":"Textes!A303","v":"Mise en poulailler"},{"$f":"D27*0.04","v":0},{"$f":"IF(D27>0,D27,0)","v":0},null,null,null,null,null,{"$f":"IF(OR(B27=\"\",D27=\"\"),0,IF((I$6-B27)=0,1,H27+(I$6-B27)))","v":0},{"$f":"IF(D27=\"\",0,VLOOKUP(M27,Faktoren!$B$16:$D$55,2)/1000)","v":0},null,null,null,{"$f":"IF(AND(H27 > 0, B27 > 0), LOOKUP(H27,INDEX(Faktoren!data,,1),INDEX(Faktoren!data,,5)),0)","v":0},{"$f":"D27:D33 * R27:R33","v":0}]
[null,null,"",null,{"$f":"Textes!A304","v":"1er abattage"},null,{"$f":"IF(D27-D28>0,D27-D28,0)","v":0},{"$f":"IF(AND(D28>0,B28>0),B28-B27+1,0)","v":0},{"$f":"IF(H28>0,IF(H28>Faktoren!$D$5,Faktoren!$E$4,Faktoren!$E$5),0)","v":0},{"$f":"IF(H28>0,D28*I28,0)","v":0},null,null,{"$f":"IF(OR(B28=\"\",D28=\"\"),0,H28+(I$6-B28))","v":0},{"$f":"IF(D28=\"\",0,VLOOKUP(M28,Faktoren!$B$16:$D$55,2)/1000)","v":0},null,null,null,{"$f":"IF(AND(H28 > 0, B28 > 0), LOOKUP(H28,INDEX(Faktoren!data,,1),INDEX(Faktoren!data,,5)),0)","v":0},0]
[null,null,"",null,{"$f":"Textes!A305","v":"2e abattage"},null,{"$f":"IF(D27-D28-D29>0,D27-D28-D29,0)","v":0},{"$f":"IF(AND(D29>0,B29>0),B29-B27+1,0)","v":0},{"$f":"IF(H29>0,IF(H29>Faktoren!$D$5,Faktoren!$E$4,Faktoren!$E$5),0)","v":0},{"$f":"IF(H29>0,D29*I29,0)","v":0},null,null,{"$f":"IF(OR(B29=\"\",D29=\"\"),0,H29+(I$6-B29))","v":0},{"$f":"IF(D29=\"\",0,VLOOKUP(M29,Faktoren!$B$16:$D$55,2)/1000)","v":0},null,null,null,{"$f":"IF(AND(H29 > 0, B29 > 0), LOOKUP(H29,INDEX(Faktoren!data,,1),INDEX(Faktoren!data,,5)),0)","v":0},0]
[null,null,"",null,{"$f":"Textes!A306","v":"3e abattage"},null,{"$f":"IF(D27-D28-D29-D30>0,D27-D28-D29-D30,0)","v":0},{"$f":"IF(AND(D30>0,B30>0),B30-B27+1,0)","v":0},{"$f":"IF(H30>0,IF(H30>Faktoren!$D$5,Faktoren!$E$4,Faktoren!$E$5),0)","v":0},{"$f":"IF(H30>0,D30*I30,0)","v":0},null,null,{"$f":"IF(OR(B30=\"\",D30=\"\"),0,H30+(I$6-B30))","v":0},{"$f":"IF(D30=\"\",0,VLOOKUP(M30,Faktoren!$B$16:$D$55,2)/1000)","v":0},null,null,null,{"$f":"IF(AND(H30 > 0, B30 > 0), LOOKUP(H30,INDEX(Faktoren!data,,1),INDEX(Faktoren!data,,5)),0)","v":0},0]
[null,null,"",null,{"$f":"Textes!A307","v":"4e abattage"},null,{"$f":"IF(D27-D28-D29-D30-D31>0,D27-D28-D29-D30-D31,0)","v":0},{"$f":"IF(AND(D31>0,B31>0),B31-B27+1,0)","v":0},{"$f":"IF(H31>0,IF(H31>Faktoren!$D$5,Faktoren!$E$4,Faktoren!$E$5),0)","v":0},{"$f":"IF(H31>0,D31*I31,0)","v":0},null,null,{"$f":"IF(OR(B31=\"\",D31=\"\"),0,H31+(I$6-B31))","v":0},{"$f":"IF(D31=\"\",0,VLOOKUP(M31,Faktoren!$B$16:$D$55,2)/1000)","v":0},null,null,null,{"$f":"IF(AND(H31 > 0, B31 > 0), LOOKUP(H31,INDEX(Faktoren!data,,1),INDEX(Faktoren!data,,5)),0)","v":0},0]
[null,null,"",null,{"$f":"Textes!A308","v":"5e abattage"},null,{"$f":"IF(D27-D28-D29-D30-D31-D32>0,D27-D28-D29-D30-D31-D32,0)","v":0},{"$f":"IF(AND(D32>0,B32>0),B32-B27+1,0)","v":0},{"$f":"IF(H32>0,IF(H32>Faktoren!$D$5,Faktoren!$E$4,Faktoren!$E$5),0)","v":0},{"$f":"IF(H32>0,D32*I32,0)","v":0},null,null,{"$f":"IF(OR(B32=\"\",D32=\"\"),0,H32+(I$6-B32))","v":0},{"$f":"IF(D32=\"\",0,VLOOKUP(M32,Faktoren!$B$16:$D$55,2)/1000)","v":0},null,null,null,{"$f":"IF(AND(H32 > 0, B32 > 0), LOOKUP(H32,INDEX(Faktoren!data,,1),INDEX(Faktoren!data,,5)),0)","v":0},0]
[null,{"$f":"IF(SUM(B27:B32) > 0,E33,\"\")","v":""},null,{"$f":"+D27-SUM(D28:D32)","v":0},{"$f":"Textes!A309","v":"pertes"},{"$f":"D33*0.6","v":0},null,null,{"$f":"IF(D33>0,Faktoren!$E$7,0)","v":0},{"$f":"IF(D33>0,D33*I33,0)","v":0},{"$f":"SUM(J28:J33)","v":0},null,{"$f":"IF(MAX(B27:B32)<$I$6,0,VLOOKUP($I$6,B27:G32,6))","v":0},null,{"$f":"MAX(B27:B32)","v":"00:00:00"},{"$f":"IF(OR($F$6=\"\",I$6=\"\",O33<F$6),99,IF(AND(O33>F$6,O33<=I$6),0,1))","v":99},null,{"$f":"IF(AND(H33 > 0, B33 > 0), LOOKUP(H33,INDEX(Faktoren!data,,1),INDEX(Faktoren!data,,5)),0)","v":0},0,{"$f":"SUM(S27:S33)","v":0}]
[null,null,null,{"$f":"IF(D27>0,ROUND(+D33/D27*100,1),0)","v":0},{"$f":"Textes!A310","v":"pertes en %"},null,"belegt",{"$f":"MAX(H27:H32)","v":0},{"$f":"Textes!A312","v":"jours poulailler occupé"},null,null,null,null,{"$f":"IF(P33=1,$I$6-B27+1,H34)","v":0}]
[null,null,null,{"$f":"IF(P33=99,0,IF(P33=0,H34/MAX(H28:H32),IF(P33=1,(H34-(O33-$I$6))/H34,0)))","v":0},{"$f":"Textes!A311","v":"Rotations"},null,null,{"$f":"IF(B37<>0,(B37-O33),0)","v":0},{"$f":"Textes!A313","v":"jours poulailler inoccupé"}]
[null,{"$f":"Textes!A293","v":"Rotation 3"}]
[null,null,{"$f":"IF(ISERROR(Jahr), \"\", IF($F$6>B37,\"\",IF(B37>$I$6,Jahr + 1,Jahr)))","v":""},null,{"$f":"Textes!A303","v":"Mise en poulailler"},{"$f":"D37*0.04","v":0},{"$f":"IF(D37>0,D37,0)","v":0},null,null,null,null,null,{"$f":"IF(OR(B37=\"\",D37=\"\"),0,IF((I$6-B37)=0,1,H37+(I$6-B37)))","v":0},{"$f":"IF(D37=\"\",0,VLOOKUP(M37,Faktoren!$B$16:$D$55,2)/1000)","v":0},null,null,null,{"$f":"IF(AND(H37 > 0, B37 > 0), LOOKUP(H37,INDEX(Faktoren!data,,1),INDEX(Faktoren!data,,5)),0)","v":0},{"$f":"D37:D43 * R37:R43","v":0}]
[null,null,"",null,{"$f":"Textes!A304","v":"1er abattage"},null,{"$f":"IF(D37-D38>0,D37-D38,0)","v":0},{"$f":"IF(AND(D38>0,B38>0),B38-B37+1,0)","v":0},{"$f":"IF(H38>0,IF(H38>Faktoren!$D$5,Faktoren!$E$4,Faktoren!$E$5),0)","v":0},{"$f":"IF(H38>0,D38*I38,0)","v":0},null,null,{"$f":"IF(OR(B38=\"\",D38=\"\"),0,H38+(I$6-B38))","v":0},{"$f":"IF(D38=\"\",0,VLOOKUP(M38,Faktoren!$B$16:$D$55,2)/1000)","v":0},null,null,null,{"$f":"IF(AND(H38 > 0, B38 > 0), LOOKUP(H38,INDEX(Faktoren!data,,1),INDEX(Faktoren!data,,5)),0)","v":0},0]
[null,null,"",null,{"$f":"Textes!A305","v":"2e abattage"},null,{"$f":"IF(D37-D38-D39>0,D37-D38-D39,0)","v":0},{"$f":"IF(AND(D39>0,B39>0),B39-B37+1,0)","v":0},{"$f":"IF(H39>0,IF(H39>Faktoren!$D$5,Faktoren!$E$4,Faktoren!$E$5),0)","v":0},{"$f":"IF(H39>0,D39*I39,0)","v":0},null,null,{"$f":"IF(OR(B39=\"\",D39=\"\"),0,H39+(I$6-B39))","v":0},{"$f":"IF(D39=\"\",0,VLOOKUP(M39,Faktoren!$B$16:$D$55,2)/1000)","v":0},null,null,null,{"$f":"IF(AND(H39 > 0, B39 > 0), LOOKUP(H39,INDEX(Faktoren!data,,1),INDEX(Faktoren!data,,5)),0)","v":0},0]
[null,null,"",null,{"$f":"Textes!A306","v":"3e abattage"},null,{"$f":"IF(D37-D38-D39-D40>0,D37-D38-D39-D40,0)","v":0},{"$f":"IF(AND(D40>0,B40>0),B40-B37+1,0)","v":0},{"$f":"IF(H40>0,IF(H40>Faktoren!$D$5,Faktoren!$E$4,Faktoren!$E$5),0)","v":0},{"$f":"IF(H40>0,D40*I40,0)","v":0},null,null,{"$f":"IF(OR(B40=\"\",D40=\"\"),0,H40+(I$6-B40))","v":0},{"$f":"IF(D40=\"\",0,VLOOKUP(M40,Faktoren!$B$16:$D$55,2)/1000)","v":0},null,null,null,{"$f":"IF(AND(H40 > 0, B40 > 0), LOOKUP(H40,INDEX(Faktoren!data,,1),INDEX(Faktoren!data,,5)),0)","v":0},0]
[null,null,"",null,{"$f":"Textes!A307","v":"4e abattage"},null,{"$f":"IF(D37-D38-D39-D40-D41>0,D37-D38-D39-D40-D41,0)","v":0},{"$f":"IF(AND(D41>0,B41>0),B41-B37+1,0)","v":0},{"$f":"IF(H41>0,IF(H41>Faktoren!$D$5,Faktoren!$E$4,Faktoren!$E$5),0)","v":0},{"$f":"IF(H41>0,D41*I41,0)","v":0},null,null,{"$f":"IF(OR(B41=\"\",D41=\"\"),0,H41+(I$6-B41))","v":0},{"$f":"IF(D41=\"\",0,VLOOKUP(M41,Faktoren!$B$16:$D$55,2)/1000)","v":0},null,null,null,{"$f":"IF(AND(H41 > 0, B41 > 0), LOOKUP(H41,INDEX(Faktoren!data,,1),INDEX(Faktoren!data,,5)),0)","v":0},0]
[null,null,"",null,{"$f":"Textes!A308","v":"5e abattage"},null,{"$f":"IF(D37-D38-D39-D40-D41-D42>0,D37-D38-D39-D40-D41-D42,0)","v":0},{"$f":"IF(AND(D42>0,B42>0),B42-B37+1,0)","v":0},{"$f":"IF(H42>0,IF(H42>Faktoren!$D$5,Faktoren!$E$4,Faktoren!$E$5),0)","v":0},{"$f":"IF(H42>0,D42*I42,0)","v":0},null,null,{"$f":"IF(OR(B42=\"\",D42=\"\"),0,H42+(I$6-B42))","v":0},{"$f":"IF(D42=\"\",0,VLOOKUP(M42,Faktoren!$B$16:$D$55,2)/1000)","v":0},null,null,null,{"$f":"IF(AND(H42 > 0, B42 > 0), LOOKUP(H42,INDEX(Faktoren!data,,1),INDEX(Faktoren!data,,5)),0)","v":0},0]
[null,{"$f":"IF(SUM(B37:B42) > 0,E43,\"\")","v":""},null,{"$f":"+D37-SUM(D38:D42)","v":0},{"$f":"Textes!A309","v":"pertes"},{"$f":"D43*0.6","v":0},null,null,{"$f":"IF(D43>0,Faktoren!$E$7,0)","v":0},{"$f":"IF(D43>0,D43*I43,0)","v":0},{"$f":"SUM(J38:J43)","v":0},null,{"$f":"IF(MAX(B37:B42)<$I$6,0,VLOOKUP($I$6,B37:G42,6))","v":0},null,{"$f":"MAX(B37:B42)","v":"00:00:00"},{"$f":"IF(OR($F$6=\"\",I$6=\"\",O43<F$6),99,IF(AND(O43>F$6,O43<=I$6),0,1))","v":99},null,{"$f":"IF(AND(H43 > 0, B43 > 0), LOOKUP(H43,INDEX(Faktoren!data,,1),INDEX(Faktoren!data,,5)),0)","v":0},0,{"$f":"SUM(S37:S43)","v":0}]
[null,null,null,{"$f":"IF(D37>0,ROUND(+D43/D37*100,1),0)","v":0},{"$f":"Textes!A310","v":"pertes en %"},null,"belegt",{"$f":"MAX(H37:H42)","v":0},{"$f":"Textes!A312","v":"jours poulailler occupé"},null,null,null,null,{"$f":"IF(P43=1,$I$6-B37+1,H44)","v":0}]
[null,null,null,{"$f":"IF(P43=99,0,IF(P43=0,H44/MAX(H38:H42),IF(P43=1,(H44-(O43-$I$6))/H44,0)))","v":0},{"$f":"Textes!A311","v":"Rotations"},null,null,{"$f":"IF(B47<>0,(B47-O43),0)","v":0},{"$f":"Textes!A313","v":"jours poulailler inoccupé"}]
[null,{"$f":"Textes!A294","v":"Rotation 4"}]
[null,null,{"$f":"IF(ISERROR(Jahr), \"\", IF($F$6>B47,\"\",IF(B47>$I$6,Jahr + 1,Jahr)))","v":""},null,{"$f":"Textes!A303","v":"Mise en poulailler"},{"$f":"D47*0.04","v":0},{"$f":"IF(D47>0,D47,0)","v":0},null,null,null,null,null,{"$f":"IF(OR(B47=\"\",D47=\"\"),0,IF((I$6-B47)=0,1,H47+(I$6-B47)))","v":0},{"$f":"IF(D47=\"\",0,VLOOKUP(M47,Faktoren!$B$16:$D$55,2)/1000)","v":0},null,null,null,{"$f":"IF(AND(H47 > 0, B47 > 0), LOOKUP(H47,INDEX(Faktoren!data,,1),INDEX(Faktoren!data,,5)),0)","v":0},{"$f":"D47:D53 * R47:R53","v":0}]
[null,null,"",null,{"$f":"Textes!A304","v":"1er abattage"},null,{"$f":"IF(D47-D48>0,D47-D48,0)","v":0},{"$f":"IF(AND(D48>0,B48>0),B48-B47+1,0)","v":0},{"$f":"IF(H48>0,IF(H48>Faktoren!$D$5,Faktoren!$E$4,Faktoren!$E$5),0)","v":0},{"$f":"IF(H48>0,D48*I48,0)","v":0},null,null,{"$f":"IF(OR(B48=\"\",D48=\"\"),0,H48+(I$6-B48))","v":0},{"$f":"IF(D48=\"\",0,VLOOKUP(M48,Faktoren!$B$16:$D$55,2)/1000)","v":0},null,null,null,{"$f":"IF(AND(H48 > 0, B48 > 0), LOOKUP(H48,INDEX(Faktoren!data,,1),INDEX(Faktoren!data,,5)),0)","v":0},0]
[null,null,"",null,{"$f":"Textes!A305","v":"2e abattage"},null,{"$f":"IF(D47-D48-D49>0,D47-D48-D49,0)","v":0},{"$f":"IF(AND(D49>0,B49>0),B49-B47+1,0)","v":0},{"$f":"IF(H49>0,IF(H49>Faktoren!$D$5,Faktoren!$E$4,Faktoren!$E$5),0)","v":0},{"$f":"IF(H49>0,D49*I49,0)","v":0},null,null,{"$f":"IF(OR(B49=\"\",D49=\"\"),0,H49+(I$6-B49))","v":0},{"$f":"IF(D49=\"\",0,VLOOKUP(M49,Faktoren!$B$16:$D$55,2)/1000)","v":0},null,null,null,{"$f":"IF(AND(H49 > 0, B49 > 0), LOOKUP(H49,INDEX(Faktoren!data,,1),INDEX(Faktoren!data,,5)),0)","v":0},0]
[null,null,"",null,{"$f":"Textes!A306","v":"3e abattage"},null,{"$f":"IF(D47-D48-D49-D50>0,D47-D48-D49-D50,0)","v":0},{"$f":"IF(AND(D50>0,B50>0),B50-B47+1,0)","v":0},{"$f":"IF(H50>0,IF(H50>Faktoren!$D$5,Faktoren!$E$4,Faktoren!$E$5),0)","v":0},{"$f":"IF(H50>0,D50*I50,0)","v":0},null,null,{"$f":"IF(OR(B50=\"\",D50=\"\"),0,H50+(I$6-B50))","v":0},{"$f":"IF(D50=\"\",0,VLOOKUP(M50,Faktoren!$B$16:$D$55,2)/1000)","v":0},null,null,null,{"$f":"IF(AND(H50 > 0, B50 > 0), LOOKUP(H50,INDEX(Faktoren!data,,1),INDEX(Faktoren!data,,5)),0)","v":0},0]
[null,null,"",null,{"$f":"Textes!A307","v":"4e abattage"},null,{"$f":"IF(D47-D48-D49-D50-D51>0,D47-D48-D49-D50-D51,0)","v":0},{"$f":"IF(AND(D51>0,B51>0),B51-B47+1,0)","v":0},{"$f":"IF(H51>0,IF(H51>Faktoren!$D$5,Faktoren!$E$4,Faktoren!$E$5),0)","v":0},{"$f":"IF(H51>0,D51*I51,0)","v":0},null,null,{"$f":"IF(OR(B51=\"\",D51=\"\"),0,H51+(I$6-B51))","v":0},{"$f":"IF(D51=\"\",0,VLOOKUP(M51,Faktoren!$B$16:$D$55,2)/1000)","v":0},null,null,null,{"$f":"IF(AND(H51 > 0, B51 > 0), LOOKUP(H51,INDEX(Faktoren!data,,1),INDEX(Faktoren!data,,5)),0)","v":0},0]
[null,null,"",null,{"$f":"Textes!A308","v":"5e abattage"},null,{"$f":"IF(D47-D48-D49-D50-D51-D52>0,D47-D48-D49-D50-D51-D52,0)","v":0},{"$f":"IF(AND(D52>0,B52>0),B52-B47+1,0)","v":0},{"$f":"IF(H52>0,IF(H52>Faktoren!$D$5,Faktoren!$E$4,Faktoren!$E$5),0)","v":0},{"$f":"IF(H52>0,D52*I52,0)","v":0},null,null,{"$f":"IF(OR(B52=\"\",D52=\"\"),0,H52+(I$6-B52))","v":0},{"$f":"IF(D52=\"\",0,VLOOKUP(M52,Faktoren!$B$16:$D$55,2)/1000)","v":0},null,null,null,{"$f":"IF(AND(H52 > 0, B52 > 0), LOOKUP(H52,INDEX(Faktoren!data,,1),INDEX(Faktoren!data,,5)),0)","v":0},0]
[null,{"$f":"IF(SUM(B47:B52) > 0,E53,\"\")","v":""},null,{"$f":"+D47-SUM(D48:D52)","v":0},{"$f":"Textes!A309","v":"pertes"},{"$f":"D53*0.6","v":0},null,null,{"$f":"IF(D53>0,Faktoren!$E$7,0)","v":0},{"$f":"IF(D53>0,D53*I53,0)","v":0},{"$f":"SUM(J48:J53)","v":0},null,{"$f":"IF(MAX(B47:B52)<$I$6,0,VLOOKUP($I$6,B47:G52,6))","v":0},null,{"$f":"MAX(B47:B52)","v":"00:00:00"},{"$f":"IF(OR($F$6=\"\",I$6=\"\",O53<F$6),99,IF(AND(O53>F$6,O53<=I$6),0,1))","v":99},null,{"$f":"IF(AND(H53 > 0, B53 > 0), LOOKUP(H53,INDEX(Faktoren!data,,1),INDEX(Faktoren!data,,5)),0)","v":0},0,{"$f":"SUM(S47:S53)","v":0}]
[null,null,null,{"$f":"IF(D47>0,ROUND(+D53/D47*100,1),0)","v":0},{"$f":"Textes!A310","v":"pertes en %"},null,"belegt",{"$f":"MAX(H47:H52)","v":0},{"$f":"Textes!A312","v":"jours poulailler occupé"},null,null,null,null,{"$f":"IF(P53=1,$I$6-B47+1,H54)","v":0}]
[null,null,null,{"$f":"IF(P53=99,0,IF(P53=0,H54/MAX(H48:H52),IF(P53=1,(H54-(O53-$I$6))/H54,0)))","v":0},{"$f":"Textes!A311","v":"Rotations"},null,null,{"$f":"IF(B57<>0,(B57-O53),0)","v":0},{"$f":"Textes!A313","v":"jours poulailler inoccupé"}]
[null,{"$f":"Textes!A295","v":"Rotation 5"}]
[null,null,{"$f":"IF(ISERROR(Jahr), \"\", IF($F$6>B57,\"\",IF(B57>$I$6,Jahr + 1,Jahr)))","v":""},null,{"$f":"Textes!A303","v":"Mise en poulailler"},{"$f":"D57*0.04","v":0},{"$f":"IF(D57>0,D57,0)","v":0},null,null,null,null,null,{"$f":"IF(OR(B57=\"\",D57=\"\"),0,IF((I$6-B57)=0,1,H57+(I$6-B57)))","v":0},{"$f":"IF(D57=\"\",0,VLOOKUP(M57,Faktoren!$B$16:$D$55,2)/1000)","v":0},null,null,null,{"$f":"IF(AND(H57 > 0, B57 > 0), LOOKUP(H57,INDEX(Faktoren!data,,1),INDEX(Faktoren!data,,5)),0)","v":0},{"$f":"D57:D63 * R57:R63","v":0}]
[null,null,"",null,{"$f":"Textes!A304","v":"1er abattage"},null,{"$f":"IF(D57-D58>0,D57-D58,0)","v":0},{"$f":"IF(AND(D58>0,B58>0),B58-B57+1,0)","v":0},{"$f":"IF(H58>0,IF(H58>Faktoren!$D$5,Faktoren!$E$4,Faktoren!$E$5),0)","v":0},{"$f":"IF(H58>0,D58*I58,0)","v":0},null,null,{"$f":"IF(OR(B58=\"\",D58=\"\"),0,H58+(I$6-B58))","v":0},{"$f":"IF(D58=\"\",0,VLOOKUP(M58,Faktoren!$B$16:$D$55,2)/1000)","v":0},null,null,null,{"$f":"IF(AND(H58 > 0, B58 > 0), LOOKUP(H58,INDEX(Faktoren!data,,1),INDEX(Faktoren!data,,5)),0)","v":0},0]
[null,null,"",null,{"$f":"Textes!A305","v":"2e abattage"},null,{"$f":"IF(D57-D58-D59>0,D57-D58-D59,0)","v":0},{"$f":"IF(AND(D59>0,B59>0),B59-B57+1,0)","v":0},{"$f":"IF(H59>0,IF(H59>Faktoren!$D$5,Faktoren!$E$4,Faktoren!$E$5),0)","v":0},{"$f":"IF(H59>0,D59*I59,0)","v":0},null,null,{"$f":"IF(OR(B59=\"\",D59=\"\"),0,H59+(I$6-B59))","v":0},{"$f":"IF(D59=\"\",0,VLOOKUP(M59,Faktoren!$B$16:$D$55,2)/1000)","v":0},null,null,null,{"$f":"IF(AND(H59 > 0, B59 > 0), LOOKUP(H59,INDEX(Faktoren!data,,1),INDEX(Faktoren!data,,5)),0)","v":0},0]
[null,null,"",null,{"$f":"Textes!A306","v":"3e abattage"},null,{"$f":"IF(D57-D58-D59-D60>0,D57-D58-D59-D60,0)","v":0},{"$f":"IF(AND(D60>0,B60>0),B60-B57+1,0)","v":0},{"$f":"IF(H60>0,IF(H60>Faktoren!$D$5,Faktoren!$E$4,Faktoren!$E$5),0)","v":0},{"$f":"IF(H60>0,D60*I60,0)","v":0},null,null,{"$f":"IF(OR(B60=\"\",D60=\"\"),0,H60+(I$6-B60))","v":0},{"$f":"IF(D60=\"\",0,VLOOKUP(M60,Faktoren!$B$16:$D$55,2)/1000)","v":0},null,null,null,{"$f":"IF(AND(H60 > 0, B60 > 0), LOOKUP(H60,INDEX(Faktoren!data,,1),INDEX(Faktoren!data,,5)),0)","v":0},0]
[null,null,"",null,{"$f":"Textes!A307","v":"4e abattage"},null,{"$f":"IF(D57-D58-D59-D60-D61>0,D57-D58-D59-D60-D61,0)","v":0},{"$f":"IF(AND(D61>0,B61>0),B61-B57+1,0)","v":0},{"$f":"IF(H61>0,IF(H61>Faktoren!$D$5,Faktoren!$E$4,Faktoren!$E$5),0)","v":0},{"$f":"IF(H61>0,D61*I61,0)","v":0},null,null,{"$f":"IF(OR(B61=\"\",D61=\"\"),0,H61+(I$6-B61))","v":0},{"$f":"IF(D61=\"\",0,VLOOKUP(M61,Faktoren!$B$16:$D$55,2)/1000)","v":0},null,null,null,{"$f":"IF(AND(H61 > 0, B61 > 0), LOOKUP(H61,INDEX(Faktoren!data,,1),INDEX(Faktoren!data,,5)),0)","v":0},0]
[null,null,"",null,{"$f":"Textes!A308","v":"5e abattage"},null,{"$f":"IF(D57-D58-D59-D60-D61-D62>0,D57-D58-D59-D60-D61-D62,0)","v":0},{"$f":"IF(AND(D62>0,B62>0),B62-B57+1,0)","v":0},{"$f":"IF(H62>0,IF(H62>Faktoren!$D$5,Faktoren!$E$4,Faktoren!$E$5),0)","v":0},{"$f":"IF(H62>0,D62*I62,0)","v":0},null,null,{"$f":"IF(OR(B62=\"\",D62=\"\"),0,H62+(I$6-B62))","v":0},{"$f":"IF(D62=\"\",0,VLOOKUP(M62,Faktoren!$B$16:$D$55,2)/1000)","v":0},null,null,null,{"$f":"IF(AND(H62 > 0, B62 > 0), LOOKUP(H62,INDEX(Faktoren!data,,1),INDEX(Faktoren!data,,5)),0)","v":0},0]
[null,{"$f":"IF(SUM(B57:B62) > 0,E63,\"\")","v":""},null,{"$f":"+D57-SUM(D58:D62)","v":0},{"$f":"Textes!A309","v":"pertes"},{"$f":"D63*0.6","v":0},null,null,{"$f":"IF(D63>0,Faktoren!$E$7,0)","v":0},{"$f":"IF(D63>0,D63*I63,0)","v":0},{"$f":"SUM(J58:J63)","v":0},null,{"$f":"IF(MAX(B57:B62)<$I$6,0,VLOOKUP($I$6,B57:G62,6))","v":0},null,{"$f":"MAX(B57:B62)","v":"00:00:00"},{"$f":"IF(OR($F$6=\"\",I$6=\"\",O63<F$6),99,IF(AND(O63>F$6,O63<=I$6),0,1))","v":99},null,{"$f":"IF(AND(H63 > 0, B63 > 0), LOOKUP(H63,INDEX(Faktoren!data,,1),INDEX(Faktoren!data,,5)),0)","v":0},0,{"$f":"SUM(S57:S63)","v":0}]
[null,null,null,{"$f":"IF(D57>0,ROUND(+D63/D57*100,1),0)","v":0},{"$f":"Textes!A310","v":"pertes en %"},null,"belegt",{"$f":"MAX(H57:H62)","v":0},{"$f":"Textes!A312","v":"jours poulailler occupé"},null,null,null,null,{"$f":"IF(P63=1,$I$6-B57+1,H64)","v":0}]
[null,null,null,{"$f":"IF(P63=99,0,IF(P63=0,H64/MAX(H58:H62),IF(P63=1,(H64-(O63-$I$6))/H64,0)))","v":0},{"$f":"Textes!A311","v":"Rotations"},null,null,{"$f":"IF(B69<>0,(B69-O63),0)","v":0},{"$f":"Textes!A313","v":"jours poulailler inoccupé"}]
[]
[null,{"$f":"Textes!A269","v":"Poulailler 3"},null,null,null,null,null,null,null,null,{"$f":"Textes!A338","v":"page 2"}]
[null,{"$f":"Textes!A296","v":"Rotation 6"}]
[null,null,{"$f":"IF(ISERROR(Jahr), \"\", IF($F$6>B69,\"\",IF(B69>$I$6,Jahr + 1,Jahr)))","v":""},null,{"$f":"Textes!A303","v":"Mise en poulailler"},{"$f":"D69*0.04","v":0},{"$f":"IF(D69>0,D69,0)","v":0},null,null,null,null,null,{"$f":"IF(OR(B69=\"\",D69=\"\"),0,IF((I$6-B69)=0,1,H69+(I$6-B69)))","v":0},{"$f":"IF(D69=\"\",0,VLOOKUP(M69,Faktoren!$B$16:$D$55,2)/1000)","v":0},null,null,null,{"$f":"IF(AND(H69 > 0, B69 > 0), LOOKUP(H69,INDEX(Faktoren!data,,1),INDEX(Faktoren!data,,5)),0)","v":0},{"$f":"D69:D75 * R69:R75","v":0}]
[null,null,"",null,{"$f":"Textes!A304","v":"1er abattage"},null,{"$f":"IF(D69-D70>0,D69-D70,0)","v":0},{"$f":"IF(AND(D70>0,B70>0),B70-B69+1,0)","v":0},{"$f":"IF(H70>0,IF(H70>Faktoren!$D$5,Faktoren!$E$4,Faktoren!$E$5),0)","v":0},{"$f":"IF(H70>0,D70*I70,0)","v":0},null,null,{"$f":"IF(OR(B70=\"\",D70=\"\"),0,H70+(I$6-B70))","v":0},{"$f":"IF(D70=\"\",0,VLOOKUP(M70,Faktoren!$B$16:$D$55,2)/1000)","v":0},null,null,null,{"$f":"IF(AND(H70 > 0, B70 > 0), LOOKUP(H70,INDEX(Faktoren!data,,1),INDEX(Faktoren!data,,5)),0)","v":0},0]
[null,null,"",null,{"$f":"Textes!A305","v":"2e abattage"},null,{"$f":"IF(D69-D70-D71>0,D69-D70-D71,0)","v":0},{"$f":"IF(AND(D71>0,B71>0),B71-B69+1,0)","v":0},{"$f":"IF(H71>0,IF(H71>Faktoren!$D$5,Faktoren!$E$4,Faktoren!$E$5),0)","v":0},{"$f":"IF(H71>0,D71*I71,0)","v":0},null,null,{"$f":"IF(OR(B71=\"\",D71=\"\"),0,H71+(I$6-B71))","v":0},{"$f":"IF(D71=\"\",0,VLOOKUP(M71,Faktoren!$B$16:$D$55,2)/1000)","v":0},null,null,null,{"$f":"IF(AND(H71 > 0, B71 > 0), LOOKUP(H71,INDEX(Faktoren!data,,1),INDEX(Faktoren!data,,5)),0)","v":0},0]
[null,null,"",null,{"$f":"Textes!A306","v":"3e abattage"},null,{"$f":"IF(D69-D70-D71-D72>0,D69-D70-D71-D72,0)","v":0},{"$f":"IF(AND(D72>0,B72>0),B72-B69+1,0)","v":0},{"$f":"IF(H72>0,IF(H72>Faktoren!$D$5,Faktoren!$E$4,Faktoren!$E$5),0)","v":0},{"$f":"IF(H72>0,D72*I72,0)","v":0},null,null,{"$f":"IF(OR(B72=\"\",D72=\"\"),0,H72+(I$6-B72))","v":0},{"$f":"IF(D72=\"\",0,VLOOKUP(M72,Faktoren!$B$16:$D$55,2)/1000)","v":0},null,null,null,{"$f":"IF(AND(H72 > 0, B72 > 0), LOOKUP(H72,INDEX(Faktoren!data,,1),INDEX(Faktoren!data,,5)),0)","v":0},0]
[null,null,"",null,{"$f":"Textes!A307","v":"4e abattage"},null,{"$f":"IF(D69-D70-D71-D72-D73>0,D69-D70-D71-D72-D73,0)","v":0},{"$f":"IF(AND(D73>0,B73>0),B73-B69+1,0)","v":0},{"$f":"IF(H73>0,IF(H73>Faktoren!$D$5,Faktoren!$E$4,Faktoren!$E$5),0)","v":0},{"$f":"IF(H73>0,D73*I73,0)","v":0},null,null,{"$f":"IF(OR(B73=\"\",D73=\"\"),0,H73+(I$6-B73))","v":0},{"$f":"IF(D73=\"\",0,VLOOKUP(M73,Faktoren!$B$16:$D$55,2)/1000)","v":0},null,null,null,{"$f":"IF(AND(H73 > 0, B73 > 0), LOOKUP(H73,INDEX(Faktoren!data,,1),INDEX(Faktoren!data,,5)),0)","v":0},0]
[null,null,"",null,{"$f":"Textes!A308","v":"5e abattage"},null,{"$f":"IF(D69-D70-D71-D72-D73-D74>0,D69-D70-D71-D72-D73-D74,0)","v":0},{"$f":"IF(AND(D74>0,B74>0),B74-B69+1,0)","v":0},{"$f":"IF(H74>0,IF(H74>Faktoren!$D$5,Faktoren!$E$4,Faktoren!$E$5),0)","v":0},{"$f":"IF(H74>0,D74*I74,0)","v":0},null,null,{"$f":"IF(OR(B74=\"\",D74=\"\"),0,H74+(I$6-B74))","v":0},{"$f":"IF(D74=\"\",0,VLOOKUP(M74,Faktoren!$B$16:$D$55,2)/1000)","v":0},null,null,null,{"$f":"IF(AND(H74 > 0, B74 > 0), LOOKUP(H74,INDEX(Faktoren!data,,1),INDEX(Faktoren!data,,5)),0)","v":0},0]
[null,{"$f":"IF(SUM(B69:B74) > 0,E75,\"\")","v":""},null,{"$f":"+D69-SUM(D70:D74)","v":0},{"$f":"Textes!A309","v":"pertes"},{"$f":"D75*0.6","v":0},null,null,{"$f":"IF(D75>0,Faktoren!$E$7,0)","v":0},{"$f":"IF(D75>0,D75*I75,0)","v":0},{"$f":"SUM(J70:J75)","v":0},null,{"$f":"IF(MAX(B69:B74)<$I$6,0,VLOOKUP($I$6,B69:G74,6))","v":0},null,{"$f":"MAX(B69:B74)","v":"00:00:00"},{"$f":"IF(OR($F$6=\"\",I$6=\"\",O75<F$6),99,IF(AND(O75>F$6,O75<=I$6),0,1))","v":99},null,{"$f":"IF(AND(H75 > 0, B75 > 0), LOOKUP(H75,INDEX(Faktoren!data,,1),INDEX(Faktoren!data,,5)),0)","v":0},0,{"$f":"SUM(S69:S75)","v":0}]
[null,null,null,{"$f":"IF(D69>0,ROUND(+D75/D69*100,1),0)","v":0},{"$f":"Textes!A310","v":"pertes en %"},null,"belegt",{"$f":"MAX(H69:H74)","v":0},{"$f":"Textes!A312","v":"jours poulailler occupé"},null,null,null,null,{"$f":"IF(P75=1,$I$6-B69+1,H76)","v":0}]
[null,null,null,{"$f":"IF(P75=99,0,IF(P75=0,H76/MAX(H70:H74),IF(P75=1,(H76-(O75-$I$6))/H76,0)))","v":0},{"$f":"Textes!A311","v":"Rotations"},null,null,{"$f":"IF(B79<>0,(B79-O75),0)","v":0},{"$f":"Textes!A313","v":"jours poulailler inoccupé"}]
[null,{"$f":"Textes!A297","v":"Rotation 7"}]
[null,null,{"$f":"IF(ISERROR(Jahr), \"\", IF($F$6>B79,\"\",IF(B79>$I$6,Jahr + 1,Jahr)))","v":""},null,{"$f":"Textes!A303","v":"Mise en poulailler"},{"$f":"D79*0.04","v":0},{"$f":"IF(D79>0,D79,0)","v":0},null,null,null,null,null,{"$f":"IF(OR(B79=\"\",D79=\"\"),0,IF((I$6-B79)=0,1,H79+(I$6-B79)))","v":0},{"$f":"IF(D79=\"\",0,VLOOKUP(M79,Faktoren!$B$16:$D$55,2)/1000)","v":0},null,null,null,{"$f":"IF(AND(H79 > 0, B79 > 0), LOOKUP(H79,INDEX(Faktoren!data,,1),INDEX(Faktoren!data,,5)),0)","v":0},{"$f":"D79:D85 * R79:R85","v":0}]
[null,null,"",null,{"$f":"Textes!A304","v":"1er abattage"},null,{"$f":"IF(D79-D80>0,D79-D80,0)","v":0},{"$f":"IF(AND(D80>0,B80>0),B80-B79+1,0)","v":0},{"$f":"IF(H80>0,IF(H80>Faktoren!$D$5,Faktoren!$E$4,Faktoren!$E$5),0)","v":0},{"$f":"IF(H80>0,D80*I80,0)","v":0},null,null,{"$f":"IF(OR(B80=\"\",D80=\"\"),0,H80+(I$6-B80))","v":0},{"$f":"IF(D80=\"\",0,VLOOKUP(M80,Faktoren!$B$16:$D$55,2)/1000)","v":0},null,null,null,{"$f":"IF(AND(H80 > 0, B80 > 0), LOOKUP(H80,INDEX(Faktoren!data,,1),INDEX(Faktoren!data,,5)),0)","v":0},0]
[null,null,"",null,{"$f":"Textes!A305","v":"2e abattage"},null,{"$f":"IF(D79-D80-D81>0,D79-D80-D81,0)","v":0},{"$f":"IF(AND(D81>0,B81>0),B81-B79+1,0)","v":0},{"$f":"IF(H81>0,IF(H81>Faktoren!$D$5,Faktoren!$E$4,Faktoren!$E$5),0)","v":0},{"$f":"IF(H81>0,D81*I81,0)","v":0},null,null,{"$f":"IF(OR(B81=\"\",D81=\"\"),0,H81+(I$6-B81))","v":0},{"$f":"IF(D81=\"\",0,VLOOKUP(M81,Faktoren!$B$16:$D$55,2)/1000)","v":0},null,null,null,{"$f":"IF(AND(H81 > 0, B81 > 0), LOOKUP(H81,INDEX(Faktoren!data,,1),INDEX(Faktoren!data,,5)),0)","v":0},0]
[null,null,"",null,{"$f":"Textes!A306","v":"3e abattage"},null,{"$f":"IF(D79-D80-D81-D82>0,D79-D80-D81-D82,0)","v":0},{"$f":"IF(AND(D82>0,B82>0),B82-B79+1,0)","v":0},{"$f":"IF(H82>0,IF(H82>Faktoren!$D$5,Faktoren!$E$4,Faktoren!$E$5),0)","v":0},{"$f":"IF(H82>0,D82*I82,0)","v":0},null,null,{"$f":"IF(OR(B82=\"\",D82=\"\"),0,H82+(I$6-B82))","v":0},{"$f":"IF(D82=\"\",0,VLOOKUP(M82,Faktoren!$B$16:$D$55,2)/1000)","v":0},null,null,null,{"$f":"IF(AND(H82 > 0, B82 > 0), LOOKUP(H82,INDEX(Faktoren!data,,1),INDEX(Faktoren!data,,5)),0)","v":0},0]
[null,null,"",null,{"$f":"Textes!A307","v":"4e abattage"},null,{"$f":"IF(D79-D80-D81-D82-D83>0,D79-D80-D81-D82-D83,0)","v":0},{"$f":"IF(AND(D83>0,B83>0),B83-B79+1,0)","v":0},{"$f":"IF(H83>0,IF(H83>Faktoren!$D$5,Faktoren!$E$4,Faktoren!$E$5),0)","v":0},{"$f":"IF(H83>0,D83*I83,0)","v":0},null,null,{"$f":"IF(OR(B83=\"\",D83=\"\"),0,H83+(I$6-B83))","v":0},{"$f":"IF(D83=\"\",0,VLOOKUP(M83,Faktoren!$B$16:$D$55,2)/1000)","v":0},null,null,null,{"$f":"IF(AND(H83 > 0, B83 > 0), LOOKUP(H83,INDEX(Faktoren!data,,1),INDEX(Faktoren!data,,5)),0)","v":0},0]
[null,null,"",null,{"$f":"Textes!A308","v":"5e abattage"},null,{"$f":"IF(D79-D80-D81-D82-D83-D84>0,D79-D80-D81-D82-D83-D84,0)","v":0},{"$f":"IF(AND(D84>0,B84>0),B84-B79+1,0)","v":0},{"$f":"IF(H84>0,IF(H84>Faktoren!$D$5,Faktoren!$E$4,Faktoren!$E$5),0)","v":0},{"$f":"IF(H84>0,D84*I84,0)","v":0},null,null,{"$f":"IF(OR(B84=\"\",D84=\"\"),0,H84+(I$6-B84))","v":0},{"$f":"IF(D84=\"\",0,VLOOKUP(M84,Faktoren!$B$16:$D$55,2)/1000)","v":0},null,null,null,{"$f":"IF(AND(H84 > 0, B84 > 0), LOOKUP(H84,INDEX(Faktoren!data,,1),INDEX(Faktoren!data,,5)),0)","v":0},0]
[null,{"$f":"IF(SUM(B79:B84) > 0,E85,\"\")","v":""},null,{"$f":"+D79-SUM(D80:D84)","v":0},{"$f":"Textes!A309","v":"pertes"},{"$f":"D85*0.6","v":0},null,null,{"$f":"IF(D85>0,Faktoren!$E$7,0)","v":0},{"$f":"IF(D85>0,D85*I85,0)","v":0},{"$f":"SUM(J80:J85)","v":0},null,{"$f":"IF(MAX(B79:B84)<$I$6,0,VLOOKUP($I$6,B79:G84,6))","v":0},null,{"$f":"MAX(B79:B84)","v":"00:00:00"},{"$f":"IF(OR($F$6=\"\",I$6=\"\",O85<F$6),99,IF(AND(O85>F$6,O85<=I$6),0,1))","v":99},null,{"$f":"IF(AND(H85 > 0, B85 > 0), LOOKUP(H85,INDEX(Faktoren!data,,1),INDEX(Faktoren!data,,5)),0)","v":0},0,{"$f":"SUM(S79:S85)","v":0}]
[null,null,null,{"$f":"IF(D79>0,ROUND(+D85/D79*100,1),0)","v":0},{"$f":"Textes!A310","v":"pertes en %"},null,"belegt",{"$f":"MAX(H79:H84)","v":0},{"$f":"Textes!A312","v":"jours poulailler occupé"},null,null,null,null,{"$f":"IF(P85=1,$I$6-B79+1,H86)","v":0}]
[null,null,null,{"$f":"IF(P85=99,0,IF(P85=0,H86/MAX(H80:H84),IF(P85=1,(H86-(O85-$I$6))/H86,0)))","v":0},{"$f":"Textes!A311","v":"Rotations"},null,null,{"$f":"IF(B89<>0,(B89-O85),0)","v":0},{"$f":"Textes!A313","v":"jours poulailler inoccupé"}]
[null,{"$f":"Textes!A298","v":"Rotation 8"}]
[null,null,{"$f":"IF(ISERROR(Jahr), \"\", IF($F$6>B89,\"\",IF(B89>$I$6,Jahr + 1,Jahr)))","v":""},null,{"$f":"Textes!A303","v":"Mise en poulailler"},{"$f":"D89*0.04","v":0},{"$f":"IF(D89>0,D89,0)","v":0},null,null,null,null,null,{"$f":"IF(OR(B89=\"\",D89=\"\"),0,IF((I$6-B89)=0,1,H89+(I$6-B89)))","v":0},{"$f":"IF(D89=\"\",0,VLOOKUP(M89,Faktoren!$B$16:$D$55,2)/1000)","v":0},null,null,null,{"$f":"IF(AND(H89 > 0, B89 > 0), LOOKUP(H89,INDEX(Faktoren!data,,1),INDEX(Faktoren!data,,5)),0)","v":0},{"$f":"D89:D95 * R89:R95","v":0}]
[null,null,"",null,{"$f":"Textes!A304","v":"1er abattage"},null,{"$f":"IF(D89-D90>0,D89-D90,0)","v":0},{"$f":"IF(AND(D90>0,B90>0),B90-B89+1,0)","v":0},{"$f":"IF(H90>0,IF(H90>Faktoren!$D$5,Faktoren!$E$4,Faktoren!$E$5),0)","v":0},{"$f":"IF(H90>0,D90*I90,0)","v":0},null,null,{"$f":"IF(OR(B90=\"\",D90=\"\"),0,H90+(I$6-B90))","v":0},{"$f":"IF(D90=\"\",0,VLOOKUP(M90,Faktoren!$B$16:$D$55,2)/1000)","v":0},null,null,null,{"$f":"IF(AND(H90 > 0, B90 > 0), LOOKUP(H90,INDEX(Faktoren!data,,1),INDEX(Faktoren!data,,5)),0)","v":0},0]
[null,null,"",null,{"$f":"Textes!A305","v":"2e abattage"},null,{"$f":"IF(D89-D90-D91>0,D89-D90-D91,0)","v":0},{"$f":"IF(AND(D91>0,B91>0),B91-B89+1,0)","v":0},{"$f":"IF(H91>0,IF(H91>Faktoren!$D$5,Faktoren!$E$4,Faktoren!$E$5),0)","v":0},{"$f":"IF(H91>0,D91*I91,0)","v":0},null,null,{"$f":"IF(OR(B91=\"\",D91=\"\"),0,H91+(I$6-B91))","v":0},{"$f":"IF(D91=\"\",0,VLOOKUP(M91,Faktoren!$B$16:$D$55,2)/1000)","v":0},null,null,null,{"$f":"IF(AND(H91 > 0, B91 > 0), LOOKUP(H91,INDEX(Faktoren!data,,1),INDEX(Faktoren!data,,5)),0)","v":0},0]
[null,null,"",null,{"$f":"Textes!A306","v":"3e abattage"},null,{"$f":"IF(D89-D90-D91-D92>0,D89-D90-D91-D92,0)","v":0},{"$f":"IF(AND(D92>0,B92>0),B92-B89+1,0)","v":0},{"$f":"IF(H92>0,IF(H92>Faktoren!$D$5,Faktoren!$E$4,Faktoren!$E$5),0)","v":0},{"$f":"IF(H92>0,D92*I92,0)","v":0},null,null,{"$f":"IF(OR(B92=\"\",D92=\"\"),0,H92+(I$6-B92))","v":0},{"$f":"IF(D92=\"\",0,VLOOKUP(M92,Faktoren!$B$16:$D$55,2)/1000)","v":0},null,null,null,{"$f":"IF(AND(H92 > 0, B92 > 0), LOOKUP(H92,INDEX(Faktoren!data,,1),INDEX(Faktoren!data,,5)),0)","v":0},0]
[null,null,"",null,{"$f":"Textes!A307","v":"4e abattage"},null,{"$f":"IF(D89-D90-D91-D92-D93>0,D89-D90-D91-D92-D93,0)","v":0},{"$f":"IF(AND(D93>0,B93>0),B93-B89+1,0)","v":0},{"$f":"IF(H93>0,IF(H93>Faktoren!$D$5,Faktoren!$E$4,Faktoren!$E$5),0)","v":0},{"$f":"IF(H93>0,D93*I93,0)","v":0},null,null,{"$f":"IF(OR(B93=\"\",D93=\"\"),0,H93+(I$6-B93))","v":0},{"$f":"IF(D93=\"\",0,VLOOKUP(M93,Faktoren!$B$16:$D$55,2)/1000)","v":0},null,null,null,{"$f":"IF(AND(H93 > 0, B93 > 0), LOOKUP(H93,INDEX(Faktoren!data,,1),INDEX(Faktoren!data,,5)),0)","v":0},0]
[null,null,"",null,{"$f":"Textes!A308","v":"5e abattage"},null,{"$f":"IF(D89-D90-D91-D92-D93-D94>0,D89-D90-D91-D92-D93-D94,0)","v":0},{"$f":"IF(AND(D94>0,B94>0),B94-B89+1,0)","v":0},{"$f":"IF(H94>0,IF(H94>Faktoren!$D$5,Faktoren!$E$4,Faktoren!$E$5),0)","v":0},{"$f":"IF(H94>0,D94*I94,0)","v":0},null,null,{"$f":"IF(OR(B94=\"\",D94=\"\"),0,H94+(I$6-B94))","v":0},{"$f":"IF(D94=\"\",0,VLOOKUP(M94,Faktoren!$B$16:$D$55,2)/1000)","v":0},null,null,null,{"$f":"IF(AND(H94 > 0, B94 > 0), LOOKUP(H94,INDEX(Faktoren!data,,1),INDEX(Faktoren!data,,5)),0)","v":0},0]
[null,{"$f":"IF(SUM(B89:B94) > 0,E95,\"\")","v":""},null,{"$f":"+D89-SUM(D90:D94)","v":0},{"$f":"Textes!A309","v":"pertes"},{"$f":"D95*0.6","v":0},null,null,{"$f":"IF(D95>0,Faktoren!$E$7,0)","v":0},{"$f":"IF(D95>0,D95*I95,0)","v":0},{"$f":"SUM(J90:J95)","v":0},null,{"$f":"IF(MAX(B89:B94)<$I$6,0,VLOOKUP($I$6,B89:G94,6))","v":0},null,{"$f":"MAX(B89:B94)","v":"00:00:00"},{"$f":"IF(OR($F$6=\"\",I$6=\"\",O95<F$6),99,IF(AND(O95>F$6,O95<=I$6),0,1))","v":99},null,{"$f":"IF(AND(H95 > 0, B95 > 0), LOOKUP(H95,INDEX(Faktoren!data,,1),INDEX(Faktoren!data,,5)),0)","v":0},0,{"$f":"SUM(S89:S95)","v":0}]
[null,null,null,{"$f":"IF(D89>0,ROUND(+D95/D89*100,1),0)","v":0},{"$f":"Textes!A310","v":"pertes en %"},null,"belegt",{"$f":"MAX(H89:H94)","v":0},{"$f":"Textes!A312","v":"jours poulailler occupé"},null,null,null,null,{"$f":"IF(P95=1,$I$6-B89+1,H96)","v":0}]
[null,null,null,{"$f":"IF(P95=99,0,IF(P95=0,H96/MAX(H90:H94),IF(P95=1,(H96-(O95-$I$6))/H96,0)))","v":0},{"$f":"Textes!A311","v":"Rotations"},null,null,{"$f":"IF(B99<>0,(B99-O95),0)","v":0},{"$f":"Textes!A313","v":"jours poulailler inoccupé"}]
[null,{"$f":"Textes!A299","v":"Rotation 9"}]
[null,null,{"$f":"IF(ISERROR(Jahr), \"\", IF($F$6>B99,\"\",IF(B99>$I$6,Jahr + 1,Jahr)))","v":""},null,{"$f":"Textes!A303","v":"Mise en poulailler"},{"$f":"D99*0.04","v":0},{"$f":"IF(D99>0,D99,0)","v":0},null,null,null,null,null,{"$f":"IF(OR(B99=\"\",D99=\"\"),0,IF((I$6-B99)=0,1,H99+(I$6-B99)))","v":0},{"$f":"IF(D99=\"\",0,VLOOKUP(M99,Faktoren!$B$16:$D$55,2)/1000)","v":0},null,null,null,{"$f":"IF(AND(H99 > 0, B99 > 0), LOOKUP(H99,INDEX(Faktoren!data,,1),INDEX(Faktoren!data,,5)),0)","v":0},{"$f":"D99:D105 * R99:R105","v":0}]
[null,null,"",null,{"$f":"Textes!A304","v":"1er abattage"},null,{"$f":"IF(D99-D100>0,D99-D100,0)","v":0},{"$f":"IF(AND(D100>0,B100>0),B100-B99+1,0)","v":0},{"$f":"IF(H100>0,IF(H100>Faktoren!$D$5,Faktoren!$E$4,Faktoren!$E$5),0)","v":0},{"$f":"IF(H100>0,D100*I100,0)","v":0},null,null,{"$f":"IF(OR(B100=\"\",D100=\"\"),0,H100+(I$6-B100))","v":0},{"$f":"IF(D100=\"\",0,VLOOKUP(M100,Faktoren!$B$16:$D$55,2)/1000)","v":0},null,null,null,{"$f":"IF(AND(H100 > 0, B100 > 0), LOOKUP(H100,INDEX(Faktoren!data,,1),INDEX(Faktoren!data,,5)),0)","v":0},0]
[null,null,"",null,{"$f":"Textes!A305","v":"2e abattage"},null,{"$f":"IF(D99-D100-D101>0,D99-D100-D101,0)","v":0},{"$f":"IF(AND(D101>0,B101>0),B101-B99+1,0)","v":0},{"$f":"IF(H101>0,IF(H101>Faktoren!$D$5,Faktoren!$E$4,Faktoren!$E$5),0)","v":0},{"$f":"IF(H101>0,D101*I101,0)","v":0},null,null,{"$f":"IF(OR(B101=\"\",D101=\"\"),0,H101+(I$6-B101))","v":0},{"$f":"IF(D101=\"\",0,VLOOKUP(M101,Faktoren!$B$16:$D$55,2)/1000)","v":0},null,null,null,{"$f":"IF(AND(H101 > 0, B101 > 0), LOOKUP(H101,INDEX(Faktoren!data,,1),INDEX(Faktoren!data,,5)),0)","v":0},0]
[null,null,"",null,{"$f":"Textes!A306","v":"3e abattage"},null,{"$f":"IF(D99-D100-D101-D102>0,D99-D100-D101-D102,0)","v":0},{"$f":"IF(AND(D102>0,B102>0),B102-B99+1,0)","v":0},{"$f":"IF(H102>0,IF(H102>Faktoren!$D$5,Faktoren!$E$4,Faktoren!$E$5),0)","v":0},{"$f":"IF(H102>0,D102*I102,0)","v":0},null,null,{"$f":"IF(OR(B102=\"\",D102=\"\"),0,H102+(I$6-B102))","v":0},{"$f":"IF(D102=\"\",0,VLOOKUP(M102,Faktoren!$B$16:$D$55,2)/1000)","v":0},null,null,null,{"$f":"IF(AND(H102 > 0, B102 > 0), LOOKUP(H102,INDEX(Faktoren!data,,1),INDEX(Faktoren!data,,5)),0)","v":0},0]
[null,null,"",null,{"$f":"Textes!A307","v":"4e abattage"},null,{"$f":"IF(D99-D100-D101-D102-D103>0,D99-D100-D101-D102-D103,0)","v":0},{"$f":"IF(AND(D103>0,B103>0),B103-B99+1,0)","v":0},{"$f":"IF(H103>0,IF(H103>Faktoren!$D$5,Faktoren!$E$4,Faktoren!$E$5),0)","v":0},{"$f":"IF(H103>0,D103*I103,0)","v":0},null,null,{"$f":"IF(OR(B103=\"\",D103=\"\"),0,H103+(I$6-B103))","v":0},{"$f":"IF(D103=\"\",0,VLOOKUP(M103,Faktoren!$B$16:$D$55,2)/1000)","v":0},null,null,null,{"$f":"IF(AND(H103 > 0, B103 > 0), LOOKUP(H103,INDEX(Faktoren!data,,1),INDEX(Faktoren!data,,5)),0)","v":0},0]
[null,null,"",null,{"$f":"Textes!A308","v":"5e abattage"},null,{"$f":"IF(D99-D100-D101-D102-D103-D104>0,D99-D100-D101-D102-D103-D104,0)","v":0},{"$f":"IF(AND(D104>0,B104>0),B104-B99+1,0)","v":0},{"$f":"IF(H104>0,IF(H104>Faktoren!$D$5,Faktoren!$E$4,Faktoren!$E$5),0)","v":0},{"$f":"IF(H104>0,D104*I104,0)","v":0},null,null,{"$f":"IF(OR(B104=\"\",D104=\"\"),0,H104+(I$6-B104))","v":0},{"$f":"IF(D104=\"\",0,VLOOKUP(M104,Faktoren!$B$16:$D$55,2)/1000)","v":0},null,null,null,{"$f":"IF(AND(H104 > 0, B104 > 0), LOOKUP(H104,INDEX(Faktoren!data,,1),INDEX(Faktoren!data,,5)),0)","v":0},0]
[null,{"$f":"IF(SUM(B99:B104) > 0,E105,\"\")","v":""},null,{"$f":"+D99-SUM(D100:D104)","v":0},{"$f":"Textes!A309","v":"pertes"},{"$f":"D105*0.6","v":0},null,null,{"$f":"IF(D105>0,Faktoren!$E$7,0)","v":0},{"$f":"IF(D105>0,D105*I105,0)","v":0},{"$f":"SUM(J100:J105)","v":0},null,{"$f":"IF(MAX(B99:B104)<$I$6,0,VLOOKUP($I$6,B99:G104,6))","v":0},null,{"$f":"MAX(B99:B104)","v":"00:00:00"},{"$f":"IF(OR($F$6=\"\",I$6=\"\",O105<F$6),99,IF(AND(O105>F$6,O105<=I$6),0,1))","v":99},null,{"$f":"IF(AND(H105 > 0, B105 > 0), LOOKUP(H105,INDEX(Faktoren!data,,1),INDEX(Faktoren!data,,5)),0)","v":0},0,{"$f":"SUM(S99:S105)","v":0}]
[null,null,null,{"$f":"IF(D99>0,ROUND(+D105/D99*100,1),0)","v":0},{"$f":"Textes!A310","v":"pertes en %"},null,"belegt",{"$f":"MAX(H99:H104)","v":0},{"$f":"Textes!A312","v":"jours poulailler occupé"},null,null,null,null,{"$f":"IF(P105=1,$I$6-B99+1,H106)","v":0}]
[null,null,null,{"$f":"IF(P105=99,0,IF(P105=0,H106/MAX(H100:H104),IF(P105=1,(H106-(O105-$I$6))/H106,0)))","v":0},{"$f":"Textes!A311","v":"Rotations"},null,null,{"$f":"IF(B109<>0,(B109-O105),0)","v":0},{"$f":"Textes!A313","v":"jours poulailler inoccupé"}]
[null,{"$f":"Textes!A300","v":"Rotation 10"}]
[null,null,{"$f":"IF(ISERROR(Jahr), \"\", IF($F$6>B109,\"\",IF(B109>$I$6,Jahr + 1,Jahr)))","v":""},null,{"$f":"Textes!A303","v":"Mise en poulailler"},{"$f":"D109*0.04","v":0},{"$f":"IF(D109>0,D109,0)","v":0},null,null,null,null,null,{"$f":"IF(OR(B109=\"\",D109=\"\"),0,IF((I$6-B109)=0,1,H109+(I$6-B109)))","v":0},{"$f":"IF(D109=\"\",0,VLOOKUP(M109,Faktoren!$B$16:$D$55,2)/1000)","v":0},null,null,null,{"$f":"IF(AND(H109 > 0, B109 > 0), LOOKUP(H109,INDEX(Faktoren!data,,1),INDEX(Faktoren!data,,5)),0)","v":0},{"$f":"D109:D115 * R109:R115","v":0}]
[null,null,"",null,{"$f":"Textes!A304","v":"1er abattage"},null,{"$f":"IF(D109-D110>0,D109-D110,0)","v":0},{"$f":"IF(AND(D110>0,B110>0),B110-B109+1,0)","v":0},{"$f":"IF(H110>0,IF(H110>Faktoren!$D$5,Faktoren!$E$4,Faktoren!$E$5),0)","v":0},{"$f":"IF(H110>0,D110*I110,0)","v":0},null,null,{"$f":"IF(OR(B110=\"\",D110=\"\"),0,H110+(I$6-B110))","v":0},{"$f":"IF(D110=\"\",0,VLOOKUP(M110,Faktoren!$B$16:$D$55,2)/1000)","v":0},null,null,null,{"$f":"IF(AND(H110 > 0, B110 > 0), LOOKUP(H110,INDEX(Faktoren!data,,1),INDEX(Faktoren!data,,5)),0)","v":0},0]
[null,null,"",null,{"$f":"Textes!A305","v":"2e abattage"},null,{"$f":"IF(D109-D110-D111>0,D109-D110-D111,0)","v":0},{"$f":"IF(AND(D111>0,B111>0),B111-B109+1,0)","v":0},{"$f":"IF(H111>0,IF(H111>Faktoren!$D$5,Faktoren!$E$4,Faktoren!$E$5),0)","v":0},{"$f":"IF(H111>0,D111*I111,0)","v":0},null,null,{"$f":"IF(OR(B111=\"\",D111=\"\"),0,H111+(I$6-B111))","v":0},{"$f":"IF(D111=\"\",0,VLOOKUP(M111,Faktoren!$B$16:$D$55,2)/1000)","v":0},null,null,null,{"$f":"IF(AND(H111 > 0, B111 > 0), LOOKUP(H111,INDEX(Faktoren!data,,1),INDEX(Faktoren!data,,5)),0)","v":0},0]
[null,null,"",null,{"$f":"Textes!A306","v":"3e abattage"},null,{"$f":"IF(D109-D110-D111-D112>0,D109-D110-D111-D112,0)","v":0},{"$f":"IF(AND(D112>0,B112>0),B112-B109+1,0)","v":0},{"$f":"IF(H112>0,IF(H112>Faktoren!$D$5,Faktoren!$E$4,Faktoren!$E$5),0)","v":0},{"$f":"IF(H112>0,D112*I112,0)","v":0},null,null,{"$f":"IF(OR(B112=\"\",D112=\"\"),0,H112+(I$6-B112))","v":0},{"$f":"IF(D112=\"\",0,VLOOKUP(M112,Faktoren!$B$16:$D$55,2)/1000)","v":0},null,null,null,{"$f":"IF(AND(H112 > 0, B112 > 0), LOOKUP(H112,INDEX(Faktoren!data,,1),INDEX(Faktoren!data,,5)),0)","v":0},0]
[null,null,"",null,{"$f":"Textes!A307","v":"4e abattage"},null,{"$f":"IF(D109-D110-D111-D112-D113>0,D109-D110-D111-D112-D113,0)","v":0},{"$f":"IF(AND(D113>0,B113>0),B113-B109+1,0)","v":0},{"$f":"IF(H113>0,IF(H113>Faktoren!$D$5,Faktoren!$E$4,Faktoren!$E$5),0)","v":0},{"$f":"IF(H113>0,D113*I113,0)","v":0},null,null,{"$f":"IF(OR(B113=\"\",D113=\"\"),0,H113+(I$6-B113))","v":0},{"$f":"IF(D113=\"\",0,VLOOKUP(M113,Faktoren!$B$16:$D$55,2)/1000)","v":0},null,null,null,{"$f":"IF(AND(H113 > 0, B113 > 0), LOOKUP(H113,INDEX(Faktoren!data,,1),INDEX(Faktoren!data,,5)),0)","v":0},0]
[null,null,"",null,{"$f":"Textes!A308","v":"5e abattage"},null,{"$f":"IF(D109-D110-D111-D112-D113-D114>0,D109-D110-D111-D112-D113-D114,0)","v":0},{"$f":"IF(AND(D114>0,B114>0),B114-B109+1,0)","v":0},{"$f":"IF(H114>0,IF(H114>Faktoren!$D$5,Faktoren!$E$4,Faktoren!$E$5),0)","v":0},{"$f":"IF(H114>0,D114*I114,0)","v":0},null,null,{"$f":"IF(OR(B114=\"\",D114=\"\"),0,H114+(I$6-B114))","v":0},{"$f":"IF(D114=\"\",0,VLOOKUP(M114,Faktoren!$B$16:$D$55,2)/1000)","v":0},null,null,null,{"$f":"IF(AND(H114 > 0, B114 > 0), LOOKUP(H114,INDEX(Faktoren!data,,1),INDEX(Faktoren!data,,5)),0)","v":0},0]
[null,{"$f":"IF(SUM(B109:B114) > 0,E115,\"\")","v":""},null,{"$f":"+D109-SUM(D110:D114)","v":0},{"$f":"Textes!A309","v":"pertes"},{"$f":"D115*0.6","v":0},null,null,{"$f":"IF(D115>0,Faktoren!$E$7,0)","v":0},{"$f":"IF(D115>0,D115*I115,0)","v":0},{"$f":"SUM(J110:J115)","v":0},null,{"$f":"IF(MAX(B109:B114)<$I$6,0,VLOOKUP($I$6,B109:G114,6))","v":0},null,{"$f":"MAX(B109:B114)","v":"00:00:00"},{"$f":"IF(OR($F$6=\"\",I$6=\"\",O115<F$6),99,IF(AND(O115>F$6,O115<=I$6),0,1))","v":99},null,{"$f":"IF(AND(H115 > 0, B115 > 0), LOOKUP(H115,INDEX(Faktoren!data,,1),INDEX(Faktoren!data,,5)),0)","v":0},0,{"$f":"SUM(S109:S115)","v":0}]
[null,null,null,{"$f":"IF(D109>0,ROUND(+D115/D109*100,1),0)","v":0},{"$f":"Textes!A310","v":"pertes en %"},null,"belegt",{"$f":"MAX(H109:H114)","v":0},{"$f":"Textes!A312","v":"jours poulailler occupé"},null,null,null,null,{"$f":"IF(P115=1,$I$6-B109+1,H116)","v":0}]
[null,null,null,{"$f":"IF(P115=99,0,IF(P115=0,H116/MAX(H110:H114),IF(P115=1,(H116-(O115-$I$6))/H116,0)))","v":0},{"$f":"Textes!A311","v":"Rotations"},null,null,{"$f":"IF(B119<>0,(B119-O115),0)","v":0},{"$f":"Textes!A313","v":"jours poulailler inoccupé"}]
[null,{"$f":"Textes!A301","v":"Rotation 11"}]
[null,null,{"$f":"IF(ISERROR(Jahr), \"\", IF($F$6>B119,\"\",IF(B119>$I$6,Jahr + 1,Jahr)))","v":""},null,{"$f":"Textes!A303","v":"Mise en poulailler"},{"$f":"D119*0.04","v":0},{"$f":"IF(D119>0,D119,0)","v":0},null,null,null,null,null,{"$f":"IF(OR(B119=\"\",D119=\"\"),0,IF((I$6-B119)=0,1,H119+(I$6-B119)))","v":0},{"$f":"IF(D119=\"\",0,VLOOKUP(M119,Faktoren!$B$16:$D$55,2)/1000)","v":0},null,null,null,{"$f":"IF(AND(H119 > 0, B119 > 0), LOOKUP(H119,INDEX(Faktoren!data,,1),INDEX(Faktoren!data,,5)),0)","v":0},{"$f":"D119:D125 * R119:R125","v":0}]
[null,null,"",null,{"$f":"Textes!A304","v":"1er abattage"},null,{"$f":"IF(D119-D120>0,D119-D120,0)","v":0},{"$f":"IF(AND(D120>0,B120>0),B120-B119+1,0)","v":0},{"$f":"IF(H120>0,IF(H120>Faktoren!$D$5,Faktoren!$E$4,Faktoren!$E$5),0)","v":0},{"$f":"IF(H120>0,D120*I120,0)","v":0},null,null,{"$f":"IF(OR(B120=\"\",D120=\"\"),0,H120+(I$6-B120))","v":0},{"$f":"IF(D120=\"\",0,VLOOKUP(M120,Faktoren!$B$16:$D$55,2)/1000)","v":0},null,null,null,{"$f":"IF(AND(H120 > 0, B120 > 0), LOOKUP(H120,INDEX(Faktoren!data,,1),INDEX(Faktoren!data,,5)),0)","v":0},0]
[null,null,"",null,{"$f":"Textes!A305","v":"2e abattage"},null,{"$f":"IF(D119-D120-D121>0,D119-D120-D121,0)","v":0},{"$f":"IF(AND(D121>0,B121>0),B121-B119+1,0)","v":0},{"$f":"IF(H121>0,IF(H121>Faktoren!$D$5,Faktoren!$E$4,Faktoren!$E$5),0)","v":0},{"$f":"IF(H121>0,D121*I121,0)","v":0},null,null,{"$f":"IF(OR(B121=\"\",D121=\"\"),0,H121+(I$6-B121))","v":0},{"$f":"IF(D121=\"\",0,VLOOKUP(M121,Faktoren!$B$16:$D$55,2)/1000)","v":0},null,null,null,{"$f":"IF(AND(H121 > 0, B121 > 0), LOOKUP(H121,INDEX(Faktoren!data,,1),INDEX(Faktoren!data,,5)),0)","v":0},0]
[null,null,"",null,{"$f":"Textes!A306","v":"3e abattage"},null,{"$f":"IF(D119-D120-D121-D122>0,D119-D120-D121-D122,0)","v":0},{"$f":"IF(AND(D122>0,B122>0),B122-B119+1,0)","v":0},{"$f":"IF(H122>0,IF(H122>Faktoren!$D$5,Faktoren!$E$4,Faktoren!$E$5),0)","v":0},{"$f":"IF(H122>0,D122*I122,0)","v":0},null,null,{"$f":"IF(OR(B122=\"\",D122=\"\"),0,H122+(I$6-B122))","v":0},{"$f":"IF(D122=\"\",0,VLOOKUP(M122,Faktoren!$B$16:$D$55,2)/1000)","v":0},null,null,null,{"$f":"IF(AND(H122 > 0, B122 > 0), LOOKUP(H122,INDEX(Faktoren!data,,1),INDEX(Faktoren!data,,5)),0)","v":0},0]
[null,null,"",null,{"$f":"Textes!A307","v":"4e abattage"},null,{"$f":"IF(D119-D120-D121-D122-D123>0,D119-D120-D121-D122-D123,0)","v":0},{"$f":"IF(AND(D123>0,B123>0),B123-B119+1,0)","v":0},{"$f":"IF(H123>0,IF(H123>Faktoren!$D$5,Faktoren!$E$4,Faktoren!$E$5),0)","v":0},{"$f":"IF(H123>0,D123*I123,0)","v":0},null,null,{"$f":"IF(OR(B123=\"\",D123=\"\"),0,H123+(I$6-B123))","v":0},{"$f":"IF(D123=\"\",0,VLOOKUP(M123,Faktoren!$B$16:$D$55,2)/1000)","v":0},null,null,null,{"$f":"IF(AND(H123 > 0, B123 > 0), LOOKUP(H123,INDEX(Faktoren!data,,1),INDEX(Faktoren!data,,5)),0)","v":0},0]
[null,null,"",null,{"$f":"Textes!A308","v":"5e abattage"},null,{"$f":"IF(D119-D120-D121-D122-D123-D124>0,D119-D120-D121-D122-D123-D124,0)","v":0},{"$f":"IF(AND(D124>0,B124>0),B124-B119+1,0)","v":0},{"$f":"IF(H124>0,IF(H124>Faktoren!$D$5,Faktoren!$E$4,Faktoren!$E$5),0)","v":0},{"$f":"IF(H124>0,D124*I124,0)","v":0},null,null,{"$f":"IF(OR(B124=\"\",D124=\"\"),0,H124+(I$6-B124))","v":0},{"$f":"IF(D124=\"\",0,VLOOKUP(M124,Faktoren!$B$16:$D$55,2)/1000)","v":0},null,null,null,{"$f":"IF(AND(H124 > 0, B124 > 0), LOOKUP(H124,INDEX(Faktoren!data,,1),INDEX(Faktoren!data,,5)),0)","v":0},0]
[null,{"$f":"IF(SUM(B119:B124) > 0,E125,\"\")","v":""},null,{"$f":"+D119-SUM(D120:D124)","v":0},{"$f":"Textes!A309","v":"pertes"},{"$f":"D125*0.6","v":0},null,null,{"$f":"IF(D125>0,Faktoren!$E$7,0)","v":0},{"$f":"IF(D125>0,D125*I125,0)","v":0},{"$f":"SUM(J120:J125)","v":0},null,{"$f":"IF(MAX(B119:B124)<$I$6,0,VLOOKUP($I$6,B119:G124,6))","v":0},null,{"$f":"MAX(B119:B124)","v":"00:00:00"},{"$f":"IF(OR($F$6=\"\",I$6=\"\",O125<F$6),99,IF(AND(O125>F$6,O125<=I$6),0,1))","v":99},null,{"$f":"IF(AND(H125 > 0, B125 > 0), LOOKUP(H125,INDEX(Faktoren!data,,1),INDEX(Faktoren!data,,5)),0)","v":0},0,{"$f":"SUM(S119:S125)","v":0}]
[null,null,null,{"$f":"IF(D119>0,ROUND(+D125/D119*100,1),0)","v":0},{"$f":"Textes!A310","v":"pertes en %"},null,"belegt",{"$f":"MAX(H119:H124)","v":0},{"$f":"Textes!A312","v":"jours poulailler occupé"},null,null,null,null,{"$f":"IF(P125=1,$I$6-B119+1,H126)","v":0}]
[null,null,null,{"$f":"IF(P125=99,0,IF(P125=0,H126/MAX(H120:H124),IF(P125=1,(H126-(O125-$I$6))/H126,0)))","v":0},{"$f":"Textes!A311","v":"Rotations"},null,null,{"$f":"IF(B131<>0,(B131-O125),0)","v":0},{"$f":"Textes!A313","v":"jours poulailler inoccupé"}]
[]
[null,{"$f":"Textes!A269","v":"Poulailler 3"},null,null,null,null,null,null,null,null,{"$f":"Textes!A339","v":"page 3"}]
[null,{"$f":"Textes!A302","v":"Rotation 12"}]
[null,null,{"$f":"IF(ISERROR(Jahr), \"\", IF($F$6>B131,\"\",IF(B131>$I$6,Jahr + 1,Jahr)))","v":""},null,{"$f":"Textes!A303","v":"Mise en poulailler"},{"$f":"D131*0.04","v":0},{"$f":"IF(D131>0,D131,0)","v":0},null,null,null,null,null,{"$f":"IF(OR(B131=\"\",D131=\"\"),0,IF((I$6-B131)=0,1,H131+(I$6-B131)))","v":0},{"$f":"IF(D131=\"\",0,VLOOKUP(M131,Faktoren!$B$16:$D$55,2)/1000)","v":0},null,null,null,{"$f":"IF(AND(H131 > 0, B131 > 0), LOOKUP(H131,INDEX(Faktoren!data,,1),INDEX(Faktoren!data,,5)),0)","v":0},{"$f":"D131:D137 * R131:R137","v":0}]
[null,null,"",null,{"$f":"Textes!A304","v":"1er abattage"},null,{"$f":"IF(D131-D132>0,D131-D132,0)","v":0},{"$f":"IF(AND(D132>0,B132>0),B132-B131+1,0)","v":0},{"$f":"IF(H132>0,IF(H132>Faktoren!$D$5,Faktoren!$E$4,Faktoren!$E$5),0)","v":0},{"$f":"IF(H132>0,D132*I132,0)","v":0},null,null,{"$f":"IF(OR(B132=\"\",D132=\"\"),0,H132+(I$6-B132))","v":0},{"$f":"IF(D132=\"\",0,VLOOKUP(M132,Faktoren!$B$16:$D$55,2)/1000)","v":0},null,null,null,{"$f":"IF(AND(H132 > 0, B132 > 0), LOOKUP(H132,INDEX(Faktoren!data,,1),INDEX(Faktoren!data,,5)),0)","v":0},0]
[null,null,"",null,{"$f":"Textes!A305","v":"2e abattage"},null,{"$f":"IF(D131-D132-D133>0,D131-D132-D133,0)","v":0},{"$f":"IF(AND(D133>0,B133>0),B133-B131+1,0)","v":0},{"$f":"IF(H133>0,IF(H133>Faktoren!$D$5,Faktoren!$E$4,Faktoren!$E$5),0)","v":0},{"$f":"IF(H133>0,D133*I133,0)","v":0},null,null,{"$f":"IF(OR(B133=\"\",D133=\"\"),0,H133+(I$6-B133))","v":0},{"$f":"IF(D133=\"\",0,VLOOKUP(M133,Faktoren!$B$16:$D$55,2)/1000)","v":0},null,null,null,{"$f":"IF(AND(H133 > 0, B133 > 0), LOOKUP(H133,INDEX(Faktoren!data,,1),INDEX(Faktoren!data,,5)),0)","v":0},0]
[null,null,"",null,{"$f":"Textes!A306","v":"3e abattage"},null,{"$f":"IF(D131-D132-D133-D134>0,D131-D132-D133-D134,0)","v":0},{"$f":"IF(AND(D134>0,B134>0),B134-B131+1,0)","v":0},{"$f":"IF(H134>0,IF(H134>Faktoren!$D$5,Faktoren!$E$4,Faktoren!$E$5),0)","v":0},{"$f":"IF(H134>0,D134*I134,0)","v":0},null,null,{"$f":"IF(OR(B134=\"\",D134=\"\"),0,H134+(I$6-B134))","v":0},{"$f":"IF(D134=\"\",0,VLOOKUP(M134,Faktoren!$B$16:$D$55,2)/1000)","v":0},null,null,null,{"$f":"IF(AND(H134 > 0, B134 > 0), LOOKUP(H134,INDEX(Faktoren!data,,1),INDEX(Faktoren!data,,5)),0)","v":0},0]
[null,null,"",null,{"$f":"Textes!A307","v":"4e abattage"},null,{"$f":"IF(D131-D132-D133-D134-D135>0,D131-D132-D133-D134-D135,0)","v":0},{"$f":"IF(AND(D135>0,B135>0),B135-B131+1,0)","v":0},{"$f":"IF(H135>0,IF(H135>Faktoren!$D$5,Faktoren!$E$4,Faktoren!$E$5),0)","v":0},{"$f":"IF(H135>0,D135*I135,0)","v":0},null,null,{"$f":"IF(OR(B135=\"\",D135=\"\"),0,H135+(I$6-B135))","v":0},{"$f":"IF(D135=\"\",0,VLOOKUP(M135,Faktoren!$B$16:$D$55,2)/1000)","v":0},null,null,null,{"$f":"IF(AND(H135 > 0, B135 > 0), LOOKUP(H135,INDEX(Faktoren!data,,1),INDEX(Faktoren!data,,5)),0)","v":0},0]
[null,null,"",null,{"$f":"Textes!A308","v":"5e abattage"},null,{"$f":"IF(D131-D132-D133-D134-D135-D136>0,D131-D132-D133-D134-D135-D136,0)","v":0},{"$f":"IF(AND(D136>0,B136>0),B136-B131+1,0)","v":0},{"$f":"IF(H136>0,IF(H136>Faktoren!$D$5,Faktoren!$E$4,Faktoren!$E$5),0)","v":0},{"$f":"IF(H136>0,D136*I136,0)","v":0},null,null,{"$f":"IF(OR(B136=\"\",D136=\"\"),0,H136+(I$6-B136))","v":0},{"$f":"IF(D136=\"\",0,VLOOKUP(M136,Faktoren!$B$16:$D$55,2)/1000)","v":0},null,null,null,{"$f":"IF(AND(H136 > 0, B136 > 0), LOOKUP(H136,INDEX(Faktoren!data,,1),INDEX(Faktoren!data,,5)),0)","v":0},0]
[null,{"$f":"IF(SUM(B131:B136) > 0,E137,\"\")","v":""},{"$f":"Jahr+1","v":{"$error":"#VALUE!"}},{"$f":"+D131-D132-D133-D136","v":0},{"$f":"Textes!A309","v":"pertes"},{"$f":"D137*0.6","v":0},null,null,{"$f":"IF(D137>0,Faktoren!$E$7,0)","v":0},{"$f":"IF(D137>0,D137*I137,0)","v":0},{"$f":"SUM(J132:J137)","v":0},null,{"$f":"IF(MAX(B131:B136)<$I$6,0,VLOOKUP($I$6,B131:G136,6))","v":0},null,{"$f":"MAX(B131:B136)","v":"00:00:00"},{"$f":"IF(OR($F$6=\"\",I$6=\"\",O137<F$6),99,IF(AND(O137>F$6,O137<=I$6),0,1))","v":99},null,{"$f":"IF(AND(H137 > 0, B137 > 0), LOOKUP(H137,INDEX(Faktoren!data,,1),INDEX(Faktoren!data,,5)),0)","v":0},0,{"$f":"SUM(S131:S137)","v":0}]
[null,null,null,{"$f":"IF(D131>0,ROUND(+D137/D131*100,1),0)","v":0},{"$f":"Textes!A310","v":"pertes en %"},null,"belegt",{"$f":"MAX(H131:H136)","v":0},{"$f":"Textes!A312","v":"jours poulailler occupé"},null,null,null,null,{"$f":"IF(P137=1,$I$6-B131+1,H138)","v":0}]
[null,null,null,{"$f":"IF(P137=99,0,IF(P137=0,H138/MAX(H132:H136),IF(P137=1,(H138-(O137-$I$6))/H138,0)))","v":0},{"$f":"Textes!A311","v":"Rotations"}]
[]
[null,{"$f":"Textes!A314","v":"Effectif moyen"},null,null,null,null,null,null,null,null,null,null,null,null,null,null,null,{"$f":"Poulet1!R141","v":"Effectif moyen"}]
[null,{"$f":"Textes!A315","v":"en nombre déterminant"},null,null,null,null,null,null,null,null,{"$f":"IF((K137+K125+K115+K105+K95+K85+K75+K63+K53+K43+K33+K23)>0,(K137+K125+K115+K105+K95+K85+K75+K63+K53+K43+K33+K23)/SUM(G144:G155),0)","v":0},null,null,null,null,null,null,{"$f":"Poulet1!R142","v":"en unités de la période"},null,{"$f":"IF((T137+T125+T115+T105+T95+T85+T75+T63+T53+T43+T33+T23)>0,(T137+T125+T115+T105+T95+T85+T75+T63+T53+T43+T33+T23)/SUM($G$144:$G$155),0)","v":0}]
[]
[null,"Berechnung der Anzahl Umtriebe",null,null,null,null,{"$f":"IF(AND(K23>0,K33>0,K43>0,K53>0,K63>0,K75>0,K85>0,K95>0,K105>0,K115>0,K125>0,K137>0),12,0)","v":0}]
[null,null,null,null,null,null,{"$f":"IF(AND(K23>0,K33>0,K43>0,K53>0,K63>0,K75>0,K85>0,K95>0,K105>0,K115>0,K125>0,K137=0),11,0)","v":0}]
[null,null,null,null,null,null,{"$f":"IF(AND(K23>0,K33>0,K43>0,K53>0,K63>0,K75>0,K85>0,K95>0,K105>0,K115>0,K125=0,K137=0),10,0)","v":0}]
[null,null,null,null,null,null,{"$f":"IF(AND(K23>0,K33>0,K43>0,K53>0,K63>0,K75>0,K85>0,K95>0,K105>0,K115=0,K125=0,K137=0),9,0)","v":0}]
[null,null,null,null,null,null,{"$f":"IF(AND(K23>0,K33>0,K43>0,K53>0,K63>0,K75>0,K85>0,K95>0,K105=0,K115=0,K125=0,K137=0),8,0)","v":0}]
[null,null,null,null,null,null,{"$f":"IF(AND(K23>0,K33>0,K43>0,K53>0,K63>0,K75>0,K85>0,K95=0,K105=0,K115=0,K125=0,K137=0),7,0)","v":0}]
[null,null,null,null,null,null,{"$f":"IF(AND(K23>0,K33>0,K43>0,K53>0,K63>0,K75>0,K85=0,K95=0,K105=0,K115=0,K125=0,K137=0),6,0)","v":0}]
[null,null,null,null,null,null,{"$f":"IF(AND(K23>0,K33>0,K43>0,K53>0,K63>0,K75=0,K85=0,K95=0,K105=0,K115=0,K125=0,K137=0),5,0)","v":0}]
[null,null,null,null,null,null,{"$f":"IF(AND(K23>0,K33>0,K43>0,K53>0,K63=0,K75=0,K85=0,K95=0,K105=0,K115=0,K125=0,K137=0),4,0)","v":0}]
[null,null,null,null,null,null,{"$f":"IF(AND(K23>0,K33>0,K43>0,K53=0,K63=0,K75=0,K85=0,K95=0,K105=0,K115=0,K125=0,K137=0),3,0)","v":0}]
[null,null,null,null,null,null,{"$f":"IF(AND(K23>0,K33>0,K43=0,K53=0,K63=0,K75=0,K85=0,K95=0,K105=0,K115=0,K125=0,K137=0),2,0)","v":0}]
[null,null,null,null,null,null,{"$f":"IF(AND(K23>0,K33=0,K43=0,K53=0,K63=0,K75=0,K85=0,K95=0,K105=0,K115=0,K125=0,K137=0),1,0)","v":0}]
[]
[]
[null,{"$f":"Textes!A317","v":"Nombre de rotations"},null,null,{"$f":"SUM(D25,D35,D45,D55,D65,D77,D87,D97,D107,D117,D127,D139)","v":0}]
[]
[null,{"$f":"Textes!A318","v":"Durée d'occupation"},null,null,{"$f":"IF((H24+H34+H44+H54+H64+H76+H86+H96+H106+H116+H126+H138)>0,(H24+H34+H44+H54+H64+H76+H86+H96+H106+H116+H126+H138)/SUM(G144:G155),0)","v":0},null,null,{"$f":"Textes!A326","v":"(moyenne, sans interruption entre "}]
[null,{"$f":"Textes!A319","v":"par rotation"},null,null,null,null,null,{"$f":"Textes!A327","v":"les rotations)"}]
[]
[null,{"$f":"Textes!A320","v":"Durée d'occupation"},null,"B(eff)",{"$f":"(N24+N34+N44+N54+N64+N76+N86+N96+N106+N116+N126+N138)","v":0},null,null,{"$f":"Textes!A328","v":"(nombre total de jours, sans interruption entre"}]
[null,{"$f":"Textes!A321","v":"totale"},null,null,null,null,null,{"$f":"Textes!A329","v":"les rotations)"}]
[]
[null,{"$f":"Textes!A322","v":"Durée d'occupation"},null,"B(min)",270,null,null,{"$f":"Textes!A330","v":"(durée d'occupation minimale"}]
[null,{"$f":"Textes!A323","v":"minimale par an"},null,null,null,null,null,{"$f":"Textes!A331","v":"pour une utilisation normale du poulailler)"}]
[]
[null,{"$f":"Textes!A324","v":"Durée d'occupation"},null,"B(min)",{"$f":"IF(K6 = \"\",0,E166/365*K6)","v":0},null,null,{"$f":"Textes!A330","v":"(durée d'occupation minimale"}]
[null,{"$f":"Textes!A325","v":"minimale par periode"},null,null,null,null,null,{"$f":"Textes!A332","v":"calculée pour la periode)"}]
[]
[null,null,null,null,null,null,null,null,null,null,null,null,null,null,null,null,null,{"$f":"B141","v":"Effectif moyen"}]
[null,{"$f":"B141 & \" \" & R173","v":"Effectif moyen au poulailler 3"},null,null,null,null,null,null,null,null,{"$f":"IF(E163>=E169,K142,K142/E169*E163)","v":0},null,null,null,null,null,null,{"$f":"Textes!A335","v":"au poulailler 3"},null,{"$f":"IF($E$163>=$E$169,T142,T142/$E$169*$E$163)","v":0}]
[]
[null,{"$f":"Textes!A336","v":"correspond à l'effectif exprimé en UGB"},null,null,null,null,null,null,null,null,{"$f":"K173*Faktoren!E10","v":0}]
[]
[null,{"$f":"+Textes!A73","v":"Organisation de contrôle, Date:"},null,null,null,null,null,{"$f":"+Textes!A88","v":"Signature:"}]
[]
[null,{"$f":"+Textes!A77","v":"Exploitant, Date:"},null,null,null,null,null,{"$f":"+Textes!A88","v":"Signature:"}]

{"sheet":"Poulet_tot","index":31,"n_rows":41,"n_cols":15,"rows_kept":41,"cut":false,"hidden":true,"merged":[]}
[null,null,null,null,null,null,null,{"$f":"Textes!A340","v":"Sommaire poulets"}]
[]
[null,{"$f":"Textes!A341","v":"Nombre total d'animaux déterminant"}]
[null,{"$f":"Textes!A342","v":"pendant la période"}]
[]
[null,{"$f":"Textes!A343","v":"Période"},null,null,null,{"$f":"IF(Inv!$N$9>0,TEXT(Inv!DatumAnfang,Textes!A355) & \" - \" & TEXT( Inv!DatumEnde,Textes!A355),\"\")","v":""}]
[]
[null,{"$f":"Textes!A344","v":"No cantonal de l'exploitation"},null,null,null,{"$f":"IF(Inv!D4=0,\"\",Inv!D4)","v":""}]
[]
[null,{"$f":"Textes!A345","v":"Prénom, nom"},null,null,null,{"$f":"IF(Inv!D5=0,\"\",Inv!D6 & \" \" & Inv!D5)","v":""}]
[]
[null,{"$f":"Textes!A346","v":"Adresse"},null,null,null,{"$f":"IF(Inv!D7=0,\"\",Inv!D7)","v":""}]
[]
[null,{"$f":"Textes!A347","v":"NPA, lieu"},null,null,null,{"$f":"IF(Inv!D9=0,\"\",Inv!D9)","v":""}]
[]
[]
[]
[null,{"$f":"Textes!A348","v":"Nombre de poulaillers occupés"}]
[]
[]
[null,null,null,null,null,{"$f":"Textes!A349","v":"Effectif moyen selon l'OPD"},null,null,null,null,null,null,null,{"$f":"Textes!A350","v":"Effectif moyen pour l'évaluation des valeurs minimales"}]
[null,null,null,null,"Total",{"$f":"Textes!A357","v":"Nombre d'animaux"},{"$f":"Textes!A358","v":"UGB"},null,null,null,null,null,null,"Total",{"$f":"F22","v":"Nombre d'animaux"}]
[null,null,null,null,null,{"$f":"SUM(F29,F33,F37)","v":0},{"$f":"G29+G33+G37","v":0},null,null,null,null,null,null,null,{"$f":"SUM(O29,O33,O37)","v":0}]
[]
[null,null,null,null,null,{"$f":"Textes!A351","v":"Si la période correspond à l'année civile, alors l'effectif moyen selon l'OPD"},null,null,null,null,null,null,null,{"$f":"Textes!A353","v":"L'effectif moyen pour l'évaluation des valeurs minimales tient compte de la production plus"}]
[null,null,null,null,null,{"$f":"Textes!A352","v":"doit être déclaré lors du relevé des structures agricoles."},null,null,null,null,null,null,null,{"$f":"Textes!A354","v":"faible de nutriments chez les animaux dont la durée d'engraissement est plus courte."}]
[null,null,null,null,null,{"$f":"$F$21","v":"Effectif moyen selon l'OPD"},null,null,null,null,null,null,null,{"$f":"$N$21","v":"Effectif moyen pour l'évaluation des valeurs minimales"}]
[null,null,null,null,{"$f":"Textes!A360","v":"Poulailler 1"},{"$f":"Textes!A357","v":"Nombre d'animaux"},{"$f":"Textes!A358","v":"UGB"},null,null,null,null,null,null,{"$f":"E28","v":"Poulailler 1"},{"$f":"F28","v":"Nombre d'animaux"}]
[null,null,null,null,null,{"$f":"Poulet1!K173","v":0},{"$f":"Poulet1!K175","v":0},null,null,null,null,null,null,null,{"$f":"Poulet1!T173","v":0}]
[]
[null,null,null,null,null,{"$f":"$F$21","v":"Effectif moyen selon l'OPD"},null,null,null,null,null,null,null,{"$f":"$N$21","v":"Effectif moyen pour l'évaluation des valeurs minimales"}]
[null,null,null,null,{"$f":"Textes!A361","v":"Poulailler 2"},{"$f":"Textes!A357","v":"Nombre d'animaux"},{"$f":"Textes!A358","v":"UGB"},null,null,null,null,null,null,{"$f":"E32","v":"Poulailler 2"},{"$f":"F32","v":"Nombre d'animaux"}]
[null,null,null,null,null,{"$f":"Poulet2!K173","v":0},{"$f":"Poulet2!K175","v":0},null,null,null,null,null,null,null,{"$f":"Poulet2!T173","v":0}]
[]
[null,null,null,null,null,{"$f":"$F$21","v":"Effectif moyen selon l'OPD"},null,null,null,null,null,null,null,{"$f":"$N$21","v":"Effectif moyen pour l'évaluation des valeurs minimales"}]
[null,null,null,null,{"$f":"Textes!A362","v":"Poulailler 3"},{"$f":"Textes!A357","v":"Nombre d'animaux"},{"$f":"Textes!A358","v":"UGB"},null,null,null,null,null,null,{"$f":"E36","v":"Poulailler 3"},{"$f":"F36","v":"Nombre d'animaux"}]
[null,null,null,null,null,{"$f":"Poulet3!K173","v":0},{"$f":"Poulet3!K175","v":0},null,null,null,null,null,null,null,{"$f":"Poulet3!T173","v":0}]
[]
[null,{"$f":"+Textes!A73","v":"Organisation de contrôle, Date:"},null,null,null,{"$f":"+Textes!A88","v":"Signature:"}]
[]
[null,{"$f":"+Textes!A77","v":"Exploitant, Date:"},null,null,null,{"$f":"+Textes!A88","v":"Signature:"}]

{"sheet":"Reserve","index":32,"n_rows":1,"n_cols":1,"rows_kept":1,"cut":false,"hidden":false,"merged":[]}
["Reserve"]

{"sheet":"Faktoren","index":33,"n_rows":55,"n_cols":6,"rows_kept":55,"cut":false,"hidden":true,"merged":[[1,2,1,3],[12,1,14,1]]}
[]
[null,"Bezeichnung","Mastdauer",null,"Umrechnungsfaktoren"]
[null,null,"untere Grenze","obere Grenze"]
[null,"Normalmast",30,100,1]
[null,"Ultrakurzmast",1,29,0.5]
[]
[null,"Abgänge",null,null,0]
[]
[]
[null,"GVE Faktor",null,null,4.0000000000000001E-3]
[]
[]
[null,"Masttage ","Lebend-gewicht ","Zuwachs pro Tier und Tag ","Verluste ","Umrechnungs-faktor "]
[null,null,"im Stall ",null,"bis heute ","für TW"]
[null,null,"in g ","in g ","in % "]
[null,1,40,3,0.03,0.3]
[null,2,48,7,0.15,0.3]
[null,3,59,11,0.3,0.3]
[null,4,74,15,0.4,0.3]
[null,5,91,17,0.5,0.3]
[null,6,113,22,0.59,0.3]
[null,7,138,25,0.67,0.3]
[null,8,167,29,0.75,0.3]
[null,9,198,31,0.83,0.3]
[null,10,232,34,0.91,0.3]
[null,11,269,37,0.99,0.3]
[null,12,310,41,1.0900000000000001,0.3]
[null,13,355,45,1.2,0.3]
[null,14,402,47,1.31,0.3]
[null,15,451,50,1.42,0.3]
[null,16,505,53,1.53,0.3]
[null,17,560,55,1.64,0.3]
[null,18,618,58,1.75,0.3]
[null,19,679,61,1.86,0.3]
[null,20,743,64,1.97,0.3]
[null,21,809,66,2.0499999999999998,0.3]
[null,22,879,70,2.13,0.3]
[null,23,951,73,2.21,0.3]
[null,24,1027,76,2.29,0.3]
[null,25,1107,80,2.37,0.3]
[null,26,1190,83,2.4500000000000002,0.3]
[null,27,1276,86,2.5299999999999998,0.3]
[null,28,1365,89,2.6,0.3]
[null,29,1455,91,2.67,0.3]
[null,30,1547,92,2.74,0.4]
[null,31,1641,94,2.8,0.5]
[null,32,1737,96,2.87,0.6]
[null,33,1833,96,2.94,0.7]
[null,34,1930,97,3.02,0.8]
[null,35,2027,97,3.1,0.9]
[null,36,2124,97,3.14,1]
[null,37,2221,97,3.18,1]
[null,38,2316,96,3.2,1]
[null,39,2411,95,3.23,1]
[null,40,2503,92,3.26,1]

{"sheet":"Textes","index":34,"n_rows":465,"n_cols":31,"rows_kept":465,"cut":false,"hidden":true,"merged":[]}
["Texte","Français","Deutsch","Italiano","Numbers","Language","Catégorie",null,null,null,"Schweinetyp/Schlachtart",null,null,null,null,null,null,null,{"$f":"I3","v":"Schweinehaltung"},null,{"$f":"I4","v":"Junghennen"},null,{"$f":"I5","v":"Mastpoulets"},null,{"$f":"I6","v":"Masttruten"},null,{"$f":"I7","v":"Kaninchen"},null,null,"often used"]
[null,null,null,null,null,1,1,null,null,null,null,null,null,null,"Ausbeute",null,null,null,1,{"$f":"S2+0.5","v":1.5},2,{"$f":"U2+0.5","v":2.5},3,{"$f":"W2+0.5","v":3.5},4,{"$f":"Y2+0.5","v":4.5},5,{"$f":"AA2+0.5","v":5.5},null,"\n","strLf"]
[null,null,null,null,null,"Français",{"$f":"IF(Textes!F$2=1,H3,IF(Textes!F$2=2,I3,IF(Textes!F$2=3,J3,\"\")))","v":"Production porcine"},"Production porcine","Schweinehaltung",null,{"$f":"IF(Textes!F$2=1,L3,IF(Textes!F$2=2,M3,IF(Textes!F$2=3,N3,\"\")))","v":"porcs d'engraissement"},"porcs d'engraissement","Mastschweine",null,0.79,null,{"$f":"$A33","v":"Code"},{"$f":"$A34","v":"Catégorie d'animaux"},{"$f":"$A33","v":"Code"},{"$f":"$A34","v":"Catégorie d'animaux"},{"$f":"$A33","v":"Code"},{"$f":"$A34","v":"Catégorie d'animaux"},{"$f":"$A33","v":"Code"},{"$f":"$A34","v":"Catégorie d'animaux"},{"$f":"$A33","v":"Code"},{"$f":"$A34","v":"Catégorie d'animaux"},{"$f":"$A33","v":"Code"},{"$f":"$A34","v":"Catégorie d'animaux"},null,", ","strCom"]
[{"$f":"IF(Textes!F$2=1,B4,IF(Textes!F$2=2,C4,IF(Textes!F$2=3,D4,\"\")))","v":"MJ EDP"},"MJ EDP","MJ VES",null,null,"Deutsch",{"$f":"IF(Textes!F$2=1,H4,IF(Textes!F$2=2,I4,IF(Textes!F$2=3,J4,\"\")))","v":"Poulettes"},"Poulettes","Junghennen",null,{"$f":"IF(Textes!F$2=1,L4,IF(Textes!F$2=2,M4,IF(Textes!F$2=3,N4,\"\")))","v":"truies, échaudées"},"truies, échaudées","Mutterschweine, gebrüht",null,0.71,null,{"$f":"LOOKUP($G$2,$S$2:AB2,S4:AB4)","v":1611},{"$f":"LOOKUP($G$2+0.5,$S$2:AB2,S4:AB4)","v":"Truies allaitantes"},1611,{"$f":"A35","v":"Truies allaitantes"},1755,{"$f":"C41","v":"Junghennen"},1757,{"$f":"A42","v":"Poulets à l'engrais poulailler 1"},1761,{"$f":"A45","v":"Dindes de tout âge"},1861,{"$f":"A48","v":"Lapines reproductrices"}]
[{"$f":"IF(Textes!F$2=1,B5,IF(Textes!F$2=2,C5,IF(Textes!F$2=3,D5,\"\")))","v":"MJ EMV"},"MJ EMV","MJ UEG",null,null,null,{"$f":"IF(Textes!F$2=1,H5,IF(Textes!F$2=2,I5,IF(Textes!F$2=3,J5,\"\")))","v":"Poulets à l'engrais"},"Poulets à l'engrais","Mastpoulets",null,{"$f":"IF(Textes!F$2=1,L5,IF(Textes!F$2=2,M5,IF(Textes!F$2=3,N5,\"\")))","v":"truies, dépouillées"},"truies, dépouillées","Mutterschweine, gehäutet",null,0.62,null,{"$f":"LOOKUP($G$2,$S$2:AB3,S5:AB5)","v":1615},{"$f":"LOOKUP($G$2+0.5,$S$2:AB3,S5:AB5)","v":"Truies non allaitantes > 6 mois"},1615,"Truies non allaitantes > 6 mois",1755,{"$f":"C41","v":"Junghennen"},1757,{"$f":"A43","v":"Poulets à l'engrais poulailler 2"},1761,{"$f":"A45","v":"Dindes de tout âge"},1861,{"$f":"A48","v":"Lapines reproductrices"}]
[{"$f":"IF(Textes!F$2=1,B6,IF(Textes!F$2=2,C6,IF(Textes!F$2=3,D6,\"\")))","v":"MJ EDP"},{"$f":"+IF(Textes!G2=1,B4,B5)","v":"MJ EDP"},{"$f":"+IF(Textes!G2=1,C4,C5)","v":"MJ VES"},null,null,null,{"$f":"IF(Textes!F$2=1,H6,IF(Textes!F$2=2,I6,IF(Textes!F$2=3,J6,\"\")))","v":"Dindes à l'engrais"},"Dindes à l'engrais","Masttruten",null,null,null,null,null,null,null,{"$f":"LOOKUP($G$2,$S$2:AB4,S6:AB6)","v":1621},{"$f":"LOOKUP($G$2+0.5,$S$2:AB4,S6:AB6)","v":"Verrats d'élevage"},1621,"Verrats d'élevage",1755,{"$f":"C41","v":"Junghennen"},1757,{"$f":"A44","v":"Poulets à l'engrais poulailler 3"},1762,{"$f":"A46","v":"Dindes pour le préengraissement"},1862,{"$f":"A49","v":"Jeunes animaux"}]
[{"$f":"IF(Textes!F$2=1,B7,IF(Textes!F$2=2,C7,IF(Textes!F$2=3,D7,\"\")))","v":"MJ EDP kg TS"},{"$f":"+B6&\" kg TS\"","v":"MJ EDP kg TS"},{"$f":"+C6&\" kg TS\"","v":"MJ VES kg TS"},null,null,null,{"$f":"IF(Textes!F$2=1,H7,IF(Textes!F$2=2,I7,IF(Textes!F$2=3,J7,\"\")))","v":"Lapins"},"Lapins","Kaninchen",null,null,null,null,null,null,null,{"$f":"LOOKUP($G$2,$S$2:AB5,S7:AB7)","v":1631},{"$f":"LOOKUP($G$2+0.5,$S$2:AB5,S7:AB7)","v":"Porcelets sevrés < 26 kg PV"},1631,"Porcelets sevrés < 26 kg PV",null,null,null,null,1762,{"$f":"A46","v":"Dindes pour le préengraissement"},1862,{"$f":"A49","v":"Jeunes animaux"}]
[{"$f":"IF(Textes!F$2=1,B8,IF(Textes!F$2=2,C8,IF(Textes!F$2=3,D8,\"\")))","v":"Inventaire début et fin"},"Inventaire début et fin","Anfangs-, Endinventar",null,null,null,null,null,null,null,null,null,null,null,null,null,{"$f":"LOOKUP($G$2,$S$2:AB6,S8:AB8)","v":1635},{"$f":"LOOKUP($G$2+0.5,$S$2:AB6,S8:AB8)","v":"Porcelets allaités"},1635,"Porcelets allaités",null,null,null,null,1763,{"$f":"A47","v":"Dindes pour l'engraissement complet"},1863,{"$f":"A50","v":"Autres lapins"}]
[{"$f":"IF(Textes!F$2=1,B9,IF(Textes!F$2=2,C9,IF(Textes!F$2=3,D9,\"\")))","v":"No cantonal:"},"No cantonal:","Betriebs-Nr:",null,null,null,null,null,null,null,null,null,null,null,null,null,{"$f":"LOOKUP($G$2,$S$2:AB7,S9:AB9)","v":1639},{"$f":"LOOKUP($G$2+0.5,$S$2:AB7,S9:AB9)","v":"Porcs à l'engrais/remontes<6 mois"},1639,"Porcs à l'engrais/remontes<6 mois",null,null,null,null,1763,{"$f":"A47","v":"Dindes pour l'engraissement complet"},1863,{"$f":"A50","v":"Autres lapins"}]
[{"$f":"IF(Textes!F$2=1,B10,IF(Textes!F$2=2,C10,IF(Textes!F$2=3,D10,\"\")))","v":"Nom:"},"Nom:","Name:",null,"\" & BEZUG & \"",null,null,null,null,null,null,null,null,null,null,null,{"$f":"LOOKUP($G$2,$S$2:AB8,S10:AB10)","v":1639},{"$f":"LOOKUP($G$2+0.5,$S$2:AB8,S10:AB10)","v":"Porcs à l'engrais/remontes<6 mois"},1639,{"$f":"A40","v":"Porcs à l'engrais/remontes<6 mois"}]
[{"$f":"IF(Textes!F$2=1,B11,IF(Textes!F$2=2,C11,IF(Textes!F$2=3,D11,\"\")))","v":"Prénom:"},"Prénom:","Vorname:",null,null,null,null,null,null,null,null,null,null,null,null,null,{"$f":"LOOKUP($G$2,$S$2:AB9,S11:AB11)","v":1639},{"$f":"LOOKUP($G$2+0.5,$S$2:AB9,S11:AB11)","v":"Porcs à l'engrais/remontes<6 mois"},1639,{"$f":"A40","v":"Porcs à l'engrais/remontes<6 mois"}]
[{"$f":"IF(Textes!F$2=1,B12,IF(Textes!F$2=2,C12,IF(Textes!F$2=3,D12,\"\")))","v":"Complément:"},"Complément:","Adresszusatz:"]
[{"$f":"IF(Textes!F$2=1,B13,IF(Textes!F$2=2,C13,IF(Textes!F$2=3,D13,\"\")))","v":"Adresse:"},"Adresse:","Adresse:"]
[{"$f":"IF(Textes!F$2=1,B14,IF(Textes!F$2=2,C14,IF(Textes!F$2=3,D14,\"\")))","v":"NPA, lieu:"},"NPA, lieu:","PLZ, Ort:"]
[{"$f":"IF(Textes!F$2=1,B15,IF(Textes!F$2=2,C15,IF(Textes!F$2=3,D15,\"\")))","v":"Calculé par:"},"Calculé par:","Berechnet durch:"]
[{"$f":"IF(Textes!F$2=1,B16,IF(Textes!F$2=2,C16,IF(Textes!F$2=3,D16,\"\")))","v":"Firme:"},"Firme:","Firma:"]
[{"$f":"IF(Textes!F$2=1,B17,IF(Textes!F$2=2,C17,IF(Textes!F$2=3,D17,\"\")))","v":"No téléphone:"},"No téléphone:","Telefon-Nr:"]
[{"$f":"IF(Textes!F$2=1,B18,IF(Textes!F$2=2,C18,IF(Textes!F$2=3,D18,\"\")))","v":"Fax / e-mail:"},"Fax / e-mail:","Fax / E-Mail:"]
[{"$f":"IF(Textes!F$2=1,B19,IF(Textes!F$2=2,C19,IF(Textes!F$2=3,D19,\"\")))","v":"Période:"},"Période:","Periode:"]
[{"$f":"IF(Textes!F$2=1,B20,IF(Textes!F$2=2,C20,IF(Textes!F$2=3,D20,\"\")))","v":"Date début:"},"Date début:","Datum Anfang:"]
[{"$f":"IF(Textes!F$2=1,B21,IF(Textes!F$2=2,C21,IF(Textes!F$2=3,D21,\"\")))","v":"Date fin:"},"Date fin:","Datum Ende:"]
[{"$f":"IF(Textes!F$2=1,B22,IF(Textes!F$2=2,C22,IF(Textes!F$2=3,D22,\"\")))","v":"Durée en jours:"},"Durée en jours:","Dauer in Tagen:"]
[{"$f":"IF(Textes!F$2=1,B23,IF(Textes!F$2=2,C23,IF(Textes!F$2=3,D23,\"\")))","v":"Ajouter des aliments supplém."},"Ajouter des aliments supplém.","Futtermittel erweitern"]
[{"$f":"IF(Textes!F$2=1,B24,IF(Textes!F$2=2,C24,IF(Textes!F$2=3,D24,\"\")))","v":"Inventaire des animaux"},"Inventaire des animaux","Tierinventar"]
[{"$f":"IF(Textes!F$2=1,B25,IF(Textes!F$2=2,C25,IF(Textes!F$2=3,D25,\"\")))","v":"Maximum"},"Maximum","Maximale"]
[{"$f":"IF(Textes!F$2=1,B26,IF(Textes!F$2=2,C26,IF(Textes!F$2=3,D26,\"\")))","v":"de places"},"de places","Stallplätze"]
[{"$f":"IF(Textes!F$2=1,B27,IF(Textes!F$2=2,C27,IF(Textes!F$2=3,D27,\"\")))","v":"Début de la période"},"Début de la période","Anfang der Periode"]
[{"$f":"IF(Textes!F$2=1,B28,IF(Textes!F$2=2,C28,IF(Textes!F$2=3,D28,\"\")))","v":"Fin de la période"},"Fin de la période","Ende der Periode"]
[{"$f":"IF(Textes!F$2=1,B29,IF(Textes!F$2=2,C29,IF(Textes!F$2=3,D29,\"\")))","v":"Nombre"},"Nombre","Anzahl"]
[{"$f":"IF(Textes!F$2=1,B30,IF(Textes!F$2=2,C30,IF(Textes!F$2=3,D30,\"\")))","v":"Poids"},"Poids","Gewicht"]
[{"$f":"IF(Textes!F$2=1,B31,IF(Textes!F$2=2,C31,IF(Textes!F$2=3,D31,\"\")))","v":"PV / anim."},"PV / anim.","LG / Tier"]
[{"$f":"IF(Textes!F$2=1,B32,IF(Textes!F$2=2,C32,IF(Textes!F$2=3,D32,\"\")))","v":"PV"},"PV","LG"]
[{"$f":"IF(Textes!F$2=1,B33,IF(Textes!F$2=2,C33,IF(Textes!F$2=3,D33,\"\")))","v":"Code"},"Code","Code"]
[{"$f":"IF(Textes!F$2=1,B34,IF(Textes!F$2=2,C34,IF(Textes!F$2=3,D34,\"\")))","v":"Catégorie d'animaux"},"Catégorie d'animaux","Tierkategorie"]
[{"$f":"IF(Textes!F$2=1,B35,IF(Textes!F$2=2,C35,IF(Textes!F$2=3,D35,\"\")))","v":"Truies allaitantes"},"Truies allaitantes","Säugende Zuchtsauen"]
[{"$f":"IF(Textes!F$2=1,B36,IF(Textes!F$2=2,C36,IF(Textes!F$2=3,D36,\"\")))","v":"Truies non allaitantes > 6 mois"},"Truies non allaitantes > 6 mois","Nicht säugende Zuchtsauen > 6 Mte"]
[{"$f":"IF(Textes!F$2=1,B37,IF(Textes!F$2=2,C37,IF(Textes!F$2=3,D37,\"\")))","v":"Verrats d'élevage"},"Verrats d'élevage","Zuchteber"]
[{"$f":"IF(Textes!F$2=1,B38,IF(Textes!F$2=2,C38,IF(Textes!F$2=3,D38,\"\")))","v":"Porcelets sevrés < 26 kg PV"},{"$f":" \"Porcelets sevrés < \" &E38 & \" kg PV\"","v":"Porcelets sevrés < 26 kg PV"},{"$f":" \"Abgesetzte Ferkel bis \" & E38 &\" kg LG\"","v":"Abgesetzte Ferkel bis 26 kg LG"},null,{"$f":"E206","v":26}]
[{"$f":"IF(Textes!F$2=1,B39,IF(Textes!F$2=2,C39,IF(Textes!F$2=3,D39,\"\")))","v":"Porcelets allaités"},"Porcelets allaités","Saugferkel"]
[{"$f":"IF(Textes!F$2=1,B40,IF(Textes!F$2=2,C40,IF(Textes!F$2=3,D40,\"\")))","v":"Porcs à l'engrais/remontes<6 mois"},"Porcs à l'engrais/remontes<6 mois","Mastschweine&Remonten  < 6 Mte"]
[{"$f":"IF(Textes!F$2=1,B41,IF(Textes!F$2=2,C41,IF(Textes!F$2=3,D41,\"\")))","v":"Jeunes poules"},"Jeunes poules","Junghennen"]
[{"$f":"IF(Textes!F$2=1,B42,IF(Textes!F$2=2,C42,IF(Textes!F$2=3,D42,\"\")))","v":"Poulets à l'engrais poulailler 1"},"Poulets à l'engrais poulailler 1","Mastpoulets Stall 1"]
[{"$f":"IF(Textes!F$2=1,B43,IF(Textes!F$2=2,C43,IF(Textes!F$2=3,D43,\"\")))","v":"Poulets à l'engrais poulailler 2"},"Poulets à l'engrais poulailler 2","Mastpoulets Stall 2"]
[{"$f":"IF(Textes!F$2=1,B44,IF(Textes!F$2=2,C44,IF(Textes!F$2=3,D44,\"\")))","v":"Poulets à l'engrais poulailler 3"},"Poulets à l'engrais poulailler 3","Mastpoulets Stall 3"]
[{"$f":"IF(Textes!F$2=1,B45,IF(Textes!F$2=2,C45,IF(Textes!F$2=3,D45,\"\")))","v":"Dindes de tout âge"},"Dindes de tout âge","Truten jeden Alters"]
[{"$f":"IF(Textes!F$2=1,B46,IF(Textes!F$2=2,C46,IF(Textes!F$2=3,D46,\"\")))","v":"Dindes pour le préengraissement"},"Dindes pour le préengraissement","Trutenvormast"]
[{"$f":"IF(Textes!F$2=1,B47,IF(Textes!F$2=2,C47,IF(Textes!F$2=3,D47,\"\")))","v":"Dindes pour l'engraissement complet"},"Dindes pour l'engraissement complet","Trutenausmast"]
[{"$f":"IF(Textes!F$2=1,B48,IF(Textes!F$2=2,C48,IF(Textes!F$2=3,D48,\"\")))","v":"Lapines reproductrices"},"Lapines reproductrices","Produz. Zibbe"]
[{"$f":"IF(Textes!F$2=1,B49,IF(Textes!F$2=2,C49,IF(Textes!F$2=3,D49,\"\")))","v":"Jeunes animaux"},"Jeunes animaux","Jungtiere"]
[{"$f":"IF(Textes!F$2=1,B50,IF(Textes!F$2=2,C50,IF(Textes!F$2=3,D50,\"\")))","v":"Autres lapins"},"Autres lapins","Andere Kaninchen"]
[{"$f":"IF(Textes!F$2=1,B51,IF(Textes!F$2=2,C51,IF(Textes!F$2=3,D51,\"\")))","v":"Total inventaire animaux"},"Total inventaire animaux","Total Tierinventar"]
[{"$f":"IF(Textes!F$2=1,B52,IF(Textes!F$2=2,C52,IF(Textes!F$2=3,D52,\"\")))","v":"Inventaire aliments"},"Inventaire aliments","Futtermittelinventar"]
[{"$f":"IF(Textes!F$2=1,B53,IF(Textes!F$2=2,C53,IF(Textes!F$2=3,D53,\"\")))","v":"Aliments"},"Aliments","Mischfuttermittel"]
[{"$f":"IF(Textes!F$2=1,B54,IF(Textes!F$2=2,C54,IF(Textes!F$2=3,D54,\"\")))","v":"Teneur par kg aliment"},"Teneur par kg aliment","Gehalte in kg Futter"]
[{"$f":"IF(Textes!F$2=1,B55,IF(Textes!F$2=2,C55,IF(Textes!F$2=3,D55,\"\")))","v":"MS en %"},"MS en %","TS in %"]
[{"$f":"IF(Textes!F$2=1,B56,IF(Textes!F$2=2,C56,IF(Textes!F$2=3,D56,\"\")))","v":"g MA"},"g MA","g RP"]
[{"$f":"IF(Textes!F$2=1,B57,IF(Textes!F$2=2,C57,IF(Textes!F$2=3,D57,\"\")))","v":"g P"},"g P","g P"]
[{"$f":"IF(Textes!F$2=1,B58,IF(Textes!F$2=2,C58,IF(Textes!F$2=3,D58,\"\")))","v":"Début"},"Début","Anfang"]
[{"$f":"IF(Textes!F$2=1,B59,IF(Textes!F$2=2,C59,IF(Textes!F$2=3,D59,\"\")))","v":"Fin"},"Fin","Ende"]
[{"$f":"IF(Textes!F$2=1,B60,IF(Textes!F$2=2,C60,IF(Textes!F$2=3,D60,\"\")))","v":"kg d'aliment"},"kg d'aliment","Menge in kg Futter"]
[{"$f":"IF(Textes!F$2=1,B61,IF(Textes!F$2=2,C61,IF(Textes!F$2=3,D61,\"\")))","v":"Autres aliments"},"Autres aliments","Andere Futtermittel"]
[{"$f":"IF(Textes!F$2=1,B62,IF(Textes!F$2=2,C62,IF(Textes!F$2=3,D62,\"\")))","v":"Teneurs par kg de MS"},"Teneurs par kg de MS","Gehalte in kg TS"]
[{"$f":"IF(Textes!F$2=1,B63,IF(Textes!F$2=2,C63,IF(Textes!F$2=3,D63,\"\")))","v":"kg de MF"},"kg de MF","Menge in kg FS"]
[{"$f":"IF(Textes!F$2=1,B64,IF(Textes!F$2=2,C64,IF(Textes!F$2=3,D64,\"\")))","v":"Paille, granulés de paille"},"Paille, granulés de paille","Stroh, Strohpellets"]
[{"$f":"IF(Textes!F$2=1,B65,IF(Textes!F$2=2,C65,IF(Textes!F$2=3,D65,\"\")))","v":"Matériaux d’occupation, dés de fourrage grossier"},"Matériaux d’occupation, dés de fourrage grossier","Beschäftigungs-, Raufutterwürfel"]
[{"$f":"IF(Textes!F$2=1,B66,IF(Textes!F$2=2,C66,IF(Textes!F$2=3,D66,\"\")))","v":"Fourrages"},"Fourrages","Raufutter"]
[{"$f":"IF(Textes!F$2=1,B67,IF(Textes!F$2=2,C67,IF(Textes!F$2=3,D67,\"\")))","v":"kg de MS"},"kg de MS","Menge in kg TS"]
[{"$f":"IF(Textes!F$2=1,B68,IF(Textes!F$2=2,C68,IF(Textes!F$2=3,D68,\"\")))","v":"Maïs, \nplante entière"},{"$f":"\"Maïs\" & strCom & strLf & \"plante entière\"","v":"Maïs, \nplante entière"},{"$f":"\"Mais\" & strCom & strLf & \"ganze Pflanze\"","v":"Mais, \nganze Pflanze"}]
[{"$f":"IF(Textes!F$2=1,B69,IF(Textes!F$2=2,C69,IF(Textes!F$2=3,#REF!,\"\")))","v":"Ensilages de céréales \nplante entière"},{"$f":"\"Ensilages de céréales \" &strLf & \"plante entière\"","v":"Ensilages de céréales \nplante entière"},{"$f":"\"Getreide-Ganzpflanzensilage\"","v":"Getreide-Ganzpflanzensilage"}]
[{"$f":"IF(Textes!F$2=1,B70,IF(Textes!F$2=2,C70,IF(Textes!F$2=3,D70,\"\")))","v":"Herbages: \nherbe, silo, …"},{"$f":" \"Herbages: \" & strLf & \"herbe, silo, …\"","v":"Herbages: \nherbe, silo, …"},{"$f":"\"Wiesenfutter: \"  & strLf & \"Gras, Silo, …\"","v":"Wiesenfutter: \nGras, Silo, …"}]
[{"$f":"IF(Textes!F$2=1,B71,IF(Textes!F$2=2,C71,IF(Textes!F$2=3,D71,\"\")))","v":"Lactosérum"},"Lactosérum","Schotte"]
[{"$f":"IF(Textes!F$2=1,B72,IF(Textes!F$2=2,C72,IF(Textes!F$2=3,D72,\"\")))","v":"CCM"},"CCM","CCM"]
[{"$f":"IF(Textes!F$2=1,B73,IF(Textes!F$2=2,C73,IF(Textes!F$2=3,D73,\"\")))","v":"Organisation de contrôle, Date:"},"Organisation de contrôle, Date:","Kantonale Vollzugsstelle, Datum:"]
[{"$f":"IF(Textes!F$2=1,B74,IF(Textes!F$2=2,C74,IF(Textes!F$2=3,D74,\"\")))","v":"Signature:"},"Signature:","Unterschrift:"]
[{"$f":"IF(Textes!F$2=1,B75,IF(Textes!F$2=2,C75,IF(Textes!F$2=3,D75,\"\")))","v":"L'exploitant certifie l'exactitude des informations saisies sur cette feuille ainsi que les indications sur les entrées"},"L'exploitant certifie l'exactitude des informations saisies sur cette feuille ainsi que les indications sur les entrées","Der Betriebsleiter bestätigt die Vollständigkeit der Angaben auf diesem Inventarblatt, wie auch auf den"]
[{"$f":"IF(Textes!F$2=1,B76,IF(Textes!F$2=2,C76,IF(Textes!F$2=3,D76,\"\")))","v":"et les sorties d'animaux, les achats d'aliments."},"et les sorties d'animaux, les achats d'aliments.","dazugehörigen Aufzeichnungen Tiereingang, Tierausgang und Futterzufuhren."]
[{"$f":"IF(Textes!F$2=1,B77,IF(Textes!F$2=2,C77,IF(Textes!F$2=3,D77,\"\")))","v":"Exploitant, Date:"},"Exploitant, Date:","Betriebsleiter, Datum:"]
[{"$f":"IF(Textes!F$2=1,B78,IF(Textes!F$2=2,C78,IF(Textes!F$2=3,D78,\"\")))","v":"Signature de l'exploitant:"},"Signature de l'exploitant:","Unterschrift Betriebsleiter:"]
[{"$f":"IF(Textes!F$2=1,B79,IF(Textes!F$2=2,C79,IF(Textes!F$2=3,D79,\"\")))","v":"Entrée animaux"},"Entrée animaux","Tiereingang "]
[{"$f":"IF(Textes!F$2=1,B80,IF(Textes!F$2=2,C80,IF(Textes!F$2=3,D80,\"\")))","v":"Entrée animaux < 60 kg PV"},"Entrée animaux < 60 kg PV","Zufuhr Tiere bis 60 kg LG"]
[{"$f":"IF(Textes!F$2=1,B81,IF(Textes!F$2=2,C81,IF(Textes!F$2=3,D81,\"\")))","v":"Entrée animaux > 60 kg PV"},"Entrée animaux > 60 kg PV","Zufuhr Tiere über 60 kg LG"]
[{"$f":"IF(Textes!F$2=1,B82,IF(Textes!F$2=2,C82,IF(Textes!F$2=3,D82,\"\")))","v":"Entrée animaux"},"Entrée animaux","Zufuhr Tiere"]
[{"$f":"IF(Textes!F$2=1,B83,IF(Textes!F$2=2,C83,IF(Textes!F$2=3,D83,\"\")))","v":"Date"},"Date","Datum"]
[{"$f":"IF(Textes!F$2=1,B84,IF(Textes!F$2=2,C84,IF(Textes!F$2=3,D84,\"\")))","v":"Nombre"},"Nombre","Stück"]
[{"$f":"IF(Textes!F$2=1,B85,IF(Textes!F$2=2,C85,IF(Textes!F$2=3,D85,\"\")))","v":"kg PV total"},"kg PV total","kg LG total"]
[{"$f":"IF(Textes!F$2=1,B86,IF(Textes!F$2=2,C86,IF(Textes!F$2=3,D86,\"\")))","v":"Total entrée"},"Total entrée","Total Zufuhr"]
["*** Bald löschen? ***","Organisation de contrôle      Date:","Kantonale Vollzugsstelle      Datum:"]
[{"$f":"IF(Textes!F$2=1,B88,IF(Textes!F$2=2,C88,IF(Textes!F$2=3,D88,\"\")))","v":"Signature:"},"Signature:","Unterschrift:"]
[{"$f":"IF(Textes!F$2=1,B89,IF(Textes!F$2=2,C89,IF(Textes!F$2=3,D89,\"\")))","v":"Sortie animaux"},"Sortie animaux","Tierausgang"]
[{"$f":"IF(Textes!F$2=1,B90,IF(Textes!F$2=2,C90,IF(Textes!F$2=3,D90,\"\")))","v":"Choisissez la catégorie correcte!"},"Choisissez la catégorie correcte!","Korrekte Tierkategorie für die Eingabe in kg SG wählen!"]
[{"$f":"IF(Textes!F$2=1,B91,IF(Textes!F$2=2,C91,IF(Textes!F$2=3,D91,\"\")))","v":"kg PM total *"},"kg PM total *","kg SG total *"]
[{"$f":"IF(Textes!F$2=1,B92,IF(Textes!F$2=2,C92,IF(Textes!F$2=3,D92,\"\")))","v":"Inclure les ventes, les utilisations propres et les pertes d'animaux."},"Inclure les ventes, les utilisations propres et les pertes d'animaux."," Mit Angabe der Tierverkäufe, der Eigenversorgung und der Abgänge"]
[{"$f":"IF(Textes!F$2=1,B93,IF(Textes!F$2=2,C93,IF(Textes!F$2=3,D93,\"\")))","v":"Sortie animaux < 60 kg PV"},"Sortie animaux < 60 kg PV","Wegfuhr Tiere bis 60 kg LG"]
[{"$f":"IF(Textes!F$2=1,B94,IF(Textes!F$2=2,C94,IF(Textes!F$2=3,D94,\"\")))","v":"Sortie animaux > 60 kg PV"},"Sortie animaux > 60 kg PV","Wegfuhr Tiere über 60 kg LG"]
[{"$f":"IF(Textes!F$2=1,B95,IF(Textes!F$2=2,C95,IF(Textes!F$2=3,D95,\"\")))","v":"Sortie animaux"},"Sortie animaux","Wegfuhr Tiere"]
[{"$f":"IF(Textes!F$2=1,B96,IF(Textes!F$2=2,C96,IF(Textes!F$2=3,D96,\"\")))","v":"Date"},"Date","Datum"]
[{"$f":"IF(Textes!F$2=1,B97,IF(Textes!F$2=2,C97,IF(Textes!F$2=3,D97,\"\")))","v":"Nombre"},"Nombre","Stück"]
[{"$f":"IF(Textes!F$2=1,B98,IF(Textes!F$2=2,C98,IF(Textes!F$2=3,D98,\"\")))","v":"kg PV total"},"kg PV total","kg LG total"]
[{"$f":"IF(Textes!F$2=1,B99,IF(Textes!F$2=2,C99,IF(Textes!F$2=3,D99,\"\")))","v":"Total sortie"},"Total sortie","Total Wegfuhr"]
["*** Bald löschen? ***","Organisation de contrôle                Date:","Kantonale Vollzugsstelle             Datum:"]
[{"$f":"IF(Textes!F$2=1,B101,IF(Textes!F$2=2,C101,IF(Textes!F$2=3,D101,\"\")))","v":"Signature:"},"Signature:","Unterschrift:"]
[{"$f":"IF(Textes!F$2=1,B102,IF(Textes!F$2=2,C102,IF(Textes!F$2=3,D102,\"\")))","v":"* = selon le système; en kg PV ou PM"},"* = selon le système; en kg PV ou PM","* = je nach Abrechnungsart Schweineverkauf kg SG oder kg LG eintragen"]
[{"$f":"IF(Textes!F$2=1,B103,IF(Textes!F$2=2,C103,IF(Textes!F$2=3,D103,\"\")))","v":"Entrée aliments"},"Entrée aliments","Mischfutterzufuhr"]
[{"$f":"IF(Textes!F$2=1,B104,IF(Textes!F$2=2,C104,IF(Textes!F$2=3,D104,\"\")))","v":"Entrée aliments"},"Entrée aliments","Futterzufuhr"]
[{"$f":"IF(Textes!F$2=1,B105,IF(Textes!F$2=2,C105,IF(Textes!F$2=3,D105,\"\")))","v":"Moulin"},"Moulin","Futterlieferant"]
[{"$f":"IF(Textes!F$2=1,B106,IF(Textes!F$2=2,C106,IF(Textes!F$2=3,D106,\"\")))","v":"par kg d'aliment"},"par kg d'aliment","pro kg Futter"]
[{"$f":"IF(Textes!F$2=1,B107,IF(Textes!F$2=2,C107,IF(Textes!F$2=3,D107,\"\")))","v":"Date"},"Date","Datum"]
[{"$f":"IF(Textes!F$2=1,B108,IF(Textes!F$2=2,C108,IF(Textes!F$2=3,D108,\"\")))","v":"kg aliment"},"kg aliment","kg Futter"]
[{"$f":"IF(Textes!F$2=1,B109,IF(Textes!F$2=2,C109,IF(Textes!F$2=3,D109,\"\")))","v":"Total entrée"},"Total entrée","Total Zufuhr"]
["*** Bald löschen? ***","Organisation de contrôle      Date:","Kantonale Vollzugsstelle     Datum:"]
[{"$f":"IF(Textes!F$2=1,B111,IF(Textes!F$2=2,C111,IF(Textes!F$2=3,D111,\"\")))","v":"Signature:"},"Signature:","Unterschrift:"]
[{"$f":"IF(Textes!F$2=1,B112,IF(Textes!F$2=2,C112,IF(Textes!F$2=3,D112,\"\")))","v":"Tous les aliments utilisés doivent être saisis."},"Tous les aliments utilisés doivent être saisis.","Es müssen alle eingesetzten Futtermittel erfasst werden."]
[{"$f":"IF(Textes!F$2=1,B113,IF(Textes!F$2=2,C113,IF(Textes!F$2=3,D113,\"\")))","v":"En kg MF"},"En kg MF","In kg FS"]
[{"$f":"IF(Textes!F$2=1,B114,IF(Textes!F$2=2,C114,IF(Textes!F$2=3,D114,\"\")))","v":"En kg MS"},"En kg MS","In kg TS"]
[{"$f":"IF(Textes!F$2=1,B115,IF(Textes!F$2=2,C115,IF(Textes!F$2=3,D115,\"\")))","v":"kg MF"},"kg MF","kg FS"]
[{"$f":"IF(Textes!F$2=1,B116,IF(Textes!F$2=2,C116,IF(Textes!F$2=3,D116,\"\")))","v":"par kg MS"},"par kg MS","pro kg TS"]
[{"$f":"IF(Textes!F$2=1,B117,IF(Textes!F$2=2,C117,IF(Textes!F$2=3,D117,\"\")))","v":"Mois"},"Mois","Monat"]
[{"$f":"IF(Textes!F$2=1,B118,IF(Textes!F$2=2,C118,IF(Textes!F$2=3,D118,\"\")))","v":"kg MS"},"kg MS","kg TS"]
[{"$f":"IF(Textes!F$2=1,B119,IF(Textes!F$2=2,C119,IF(Textes!F$2=3,D119,\"\")))","v":"Bilan import/export"},"Bilan import/export","Import/Exportbilanz"]
[{"$f":"IF(Textes!F$2=1,B120,IF(Textes!F$2=2,C120,IF(Textes!F$2=3,D120,\"\")))","v":"Date ?"},"Date ?","Datum ?"]
[{"$f":"IF(Textes!F$2=1,B121,IF(Textes!F$2=2,C121,IF(Textes!F$2=3,D121,\"\")))","v":"Pas A: Exportation d'éléments fertilisants par les animaux"},"Pas A: Exportation d'éléments fertilisants par les animaux","Teil A: Nährstoffexport durch Tiere"]
[{"$f":"IF(Textes!F$2=1,B122,IF(Textes!F$2=2,C122,IF(Textes!F$2=3,D122,\"\")))","v":"Inv.-D"},"Inv.-D","A-Inv."]
[{"$f":"IF(Textes!F$2=1,B123,IF(Textes!F$2=2,C123,IF(Textes!F$2=3,D123,\"\")))","v":"Inv.-F"},"Inv.-F","E-Inv."]
[{"$f":"IF(Textes!F$2=1,B124,IF(Textes!F$2=2,C124,IF(Textes!F$2=3,D124,\"\")))","v":"Entrées"},"Entrées","Zukauf"]
[{"$f":"IF(Textes!F$2=1,B125,IF(Textes!F$2=2,C125,IF(Textes!F$2=3,D125,\"\")))","v":"Sorties"},"Sorties","Verkauf"]
[{"$f":"IF(Textes!F$2=1,B126,IF(Textes!F$2=2,C126,IF(Textes!F$2=3,D126,\"\")))","v":"PV total"},"PV total","LG total"]
[{"$f":"IF(Textes!F$2=1,B127,IF(Textes!F$2=2,C127,IF(Textes!F$2=3,D127,\"\")))","v":"g N / kg"},"g N / kg","g N / kg"]
[{"$f":"IF(Textes!F$2=1,B128,IF(Textes!F$2=2,C128,IF(Textes!F$2=3,D128,\"\")))","v":"g P / kg"},"g P / kg","g P / kg"]
[{"$f":"IF(Textes!F$2=1,B129,IF(Textes!F$2=2,C129,IF(Textes!F$2=3,D129,\"\")))","v":"Total kg N"},"Total kg N","Total kg N"]
[{"$f":"IF(Textes!F$2=1,B130,IF(Textes!F$2=2,C130,IF(Textes!F$2=3,D130,\"\")))","v":"Total kg P"},"Total kg P","Total kg P"]
[{"$f":"IF(Textes!F$2=1,B131,IF(Textes!F$2=2,C131,IF(Textes!F$2=3,D131,\"\")))","v":"Animaux < 60 kg PV"},"Animaux < 60 kg PV","Tiere bis 60 kg LG"]
[{"$f":"IF(Textes!F$2=1,B132,IF(Textes!F$2=2,C132,IF(Textes!F$2=3,D132,\"\")))","v":"Animaux > 60 kg PV"},"Animaux > 60 kg PV","Tiere ab 60 kg LG"]
[{"$f":"IF(Textes!F$2=1,B133,IF(Textes!F$2=2,C133,IF(Textes!F$2=3,D133,\"\")))","v":"Animaux"},"Animaux","Tiere"]
[{"$f":"IF(Textes!F$2=1,B134,IF(Textes!F$2=2,C134,IF(Textes!F$2=3,D134,\"\")))","v":"Animaux"},"Animaux","Tiere"]
[{"$f":"IF(Textes!F$2=1,B135,IF(Textes!F$2=2,C135,IF(Textes!F$2=3,D135,\"\")))","v":"Exportation totale d'éléments fertilisants"},"Exportation totale d'éléments fertilisants","Total Nährstoffexport durch Tiere"]
[{"$f":"IF(Textes!F$2=1,B136,IF(Textes!F$2=2,C136,IF(Textes!F$2=3,D136,\"\")))","v":"Pas B: Importation d'éléments fertilisants par les aliments"},"Pas B: Importation d'éléments fertilisants par les aliments","Teil B: Nährstoffimport durch Futtermittel"]
[{"$f":"IF(Textes!F$2=1,B137,IF(Textes!F$2=2,C137,IF(Textes!F$2=3,D137,\"\")))","v":"Inv.-D"},"Inv.-D","A-Inv."]
[{"$f":"IF(Textes!F$2=1,B138,IF(Textes!F$2=2,C138,IF(Textes!F$2=3,D138,\"\")))","v":"Inv.-F"},"Inv.-F","E-Inv."]
[{"$f":"IF(Textes!F$2=1,B139,IF(Textes!F$2=2,C139,IF(Textes!F$2=3,D139,\"\")))","v":"Entrées"},"Entrées","Zukauf"]
[{"$f":"IF(Textes!F$2=1,B140,IF(Textes!F$2=2,C140,IF(Textes!F$2=3,D140,\"\")))","v":"kg total"},"kg total","kg total"]
[{"$f":"IF(Textes!F$2=1,B141,IF(Textes!F$2=2,C141,IF(Textes!F$2=3,D141,\"\")))","v":"% MS"},"% MS","% TS"]
[{"$f":"IF(Textes!F$2=1,B142,IF(Textes!F$2=2,C142,IF(Textes!F$2=3,D142,\"\")))","v":"MJ EDP"},"MJ EDP","MJ VES"]
[{"$f":"IF(Textes!F$2=1,B143,IF(Textes!F$2=2,C143,IF(Textes!F$2=3,D143,\"\")))","v":"g MA / kg"},"g MA / kg","g RP / kg"]
[{"$f":"IF(Textes!F$2=1,B144,IF(Textes!F$2=2,C144,IF(Textes!F$2=3,D144,\"\")))","v":"g P / kg"},"g P / kg","g P / kg"]
[{"$f":"IF(Textes!F$2=1,B145,IF(Textes!F$2=2,C145,IF(Textes!F$2=3,D145,\"\")))","v":"Total kg N"},"Total kg N","Total kg N"]
[{"$f":"IF(Textes!F$2=1,B146,IF(Textes!F$2=2,C146,IF(Textes!F$2=3,D146,\"\")))","v":"Total kg P"},"Total kg P","Total kg P"]
[{"$f":"IF(Textes!F$2=1,B147,IF(Textes!F$2=2,C147,IF(Textes!F$2=3,D147,\"\")))","v":"en kg aliment"},"en kg aliment","in kg Futter"]
[{"$f":"IF(Textes!F$2=1,B148,IF(Textes!F$2=2,C148,IF(Textes!F$2=3,D148,\"\")))","v":"par kg aliment"},"par kg aliment","pro kg Futter"]
[{"$f":"IF(Textes!F$2=1,B149,IF(Textes!F$2=2,C149,IF(Textes!F$2=3,D149,\"\")))","v":"en kg MS"},"en kg MS","in kg TS"]
[{"$f":"IF(Textes!F$2=1,B150,IF(Textes!F$2=2,C150,IF(Textes!F$2=3,D150,\"\")))","v":"par kg MS"},"par kg MS","pro kg TS"]
[{"$f":"IF(Textes!F$2=1,B151,IF(Textes!F$2=2,C151,IF(Textes!F$2=3,D151,\"\")))","v":"Ensil. de céréal. \npl. entière"},{"$f":"\"Ensil. de céréal. \" &strLf & \"pl. entière\"","v":"Ensil. de céréal. \npl. entière"},"Getreide-Ganzpflanzensil."]
[{"$f":"IF(Textes!F$2=1,B152,IF(Textes!F$2=2,C152,IF(Textes!F$2=3,D152,\"\")))","v":"Herbages: \nherbe, silo, …"},{"$f":" \"Herbages: \"  & strLf & \"herbe, silo, …\"","v":"Herbages: \nherbe, silo, …"},{"$f":"\"Wiesenfutter: \" & strLf & \"Gras, Silo, …\"","v":"Wiesenfutter: \nGras, Silo, …"}]
[{"$f":"IF(Textes!F$2=1,B153,IF(Textes!F$2=2,C153,IF(Textes!F$2=3,D153,\"\")))","v":"Importation totale d'éléments fertilisants"},"Importation totale d'éléments fertilisants","Total Nährstoffimport durch Futtermittel"]
[{"$f":"IF(Textes!F$2=1,B154,IF(Textes!F$2=2,C154,IF(Textes!F$2=3,D154,\"\")))","v":"Pas C: Bilan import/export"},"Pas C: Bilan import/export","Teil C: Import/Export Bilanz"]
[{"$f":"IF(Textes!F$2=1,B155,IF(Textes!F$2=2,C155,IF(Textes!F$2=3,D155,\"\")))","v":"kg N"},"kg N","kg N"]
[{"$f":"IF(Textes!F$2=1,B156,IF(Textes!F$2=2,C156,IF(Textes!F$2=3,D156,\"\")))","v":"kg P"},"kg P","kg P"]
[{"$f":"IF(Textes!F$2=1,B157,IF(Textes!F$2=2,C157,IF(Textes!F$2=3,D157,\"\")))","v":"kg Nstock"},"kg Nstock","kg Nges"]
[{"$f":"IF(Textes!F$2=1,B158,IF(Textes!F$2=2,C158,IF(Textes!F$2=3,D158,\"\")))","v":"kg P2O5"},"kg P2O5","kg P2O5"]
[{"$f":"IF(Textes!F$2=1,B159,IF(Textes!F$2=2,C159,IF(Textes!F$2=3,D159,\"\")))","v":"Exportation par les animaux"},"Exportation par les animaux","Nährstoffexport Tiere"]
[{"$f":"IF(Textes!F$2=1,B160,IF(Textes!F$2=2,C160,IF(Textes!F$2=3,D160,\"\")))","v":"Importation par les aliments"},"Importation par les aliments","Nährstoffimport Futtermittel"]
[{"$f":"IF(Textes!F$2=1,B161,IF(Textes!F$2=2,C161,IF(Textes!F$2=3,D161,\"\")))","v":"Pour la période"},"Pour la période","Für die Periode"]
[{"$f":"IF(Textes!F$2=1,B162,IF(Textes!F$2=2,C162,IF(Textes!F$2=3,D162,\"\")))","v":"Pour 365 jours"},"Pour 365 jours","Pro 365 Tage"]
[{"$f":"IF(Textes!F$2=1,B163,IF(Textes!F$2=2,C163,IF(Textes!F$2=3,D163,\"\")))","v":"kg Nstock"},"kg Nstock","kg Nges"]
[{"$f":"IF(Textes!F$2=1,B164,IF(Textes!F$2=2,C164,IF(Textes!F$2=3,D164,\"\")))","v":"=> Contrôle avec les valeurs minimales"},"=> Contrôle avec les valeurs minimales","=> Vergleich mit Tiefstwerten"]
[{"$f":"IF(Textes!F$2=1,B165,IF(Textes!F$2=2,C165,IF(Textes!F$2=3,D165,\"\")))","v":"Pas D: Données de contrôle"},"Pas D: Données de contrôle","Teil D: Kontrolldaten"]
[{"$f":"IF(Textes!F$2=1,B166,IF(Textes!F$2=2,C166,IF(Textes!F$2=3,D166,\"\")))","v":"Aliment 88% MS pour 365 j"},"Aliment 88% MS pour 365 j","Futter 88% TS pro 365 Tage"]
[{"$f":"IF(Textes!F$2=1,B167,IF(Textes!F$2=2,C167,IF(Textes!F$2=3,D167,\"\")))","v":"Aliment 88% MS par kg croît"},"Aliment 88% MS par kg croît","Futter 88% TS / kg Zuwachs"]
[{"$f":"IF(Textes!F$2=1,B168,IF(Textes!F$2=2,C168,IF(Textes!F$2=3,D168,\"\")))","v":"Aliment g MA / MJ EDP"},"Aliment g MA / MJ EDP","Futter g RP / MJ VES"]
[{"$f":"IF(Textes!F$2=1,B169,IF(Textes!F$2=2,C169,IF(Textes!F$2=3,D169,\"\")))","v":"MJ / kg croît"},"MJ / kg croît","MJ / kg Zuwachs"]
[{"$f":"IF(Textes!F$2=1,B170,IF(Textes!F$2=2,C170,IF(Textes!F$2=3,D170,\"\")))","v":"MJ consommés en 365 jours"},"MJ consommés en 365 jours","MJ in 365 Tagen verfüttert"]
[{"$f":"IF(Textes!F$2=1,B171,IF(Textes!F$2=2,C171,IF(Textes!F$2=3,D171,\"\")))","v":"Teneur MS lactosérum"},"Teneur MS lactosérum","TS Gehalt Schotte"]
[{"$f":"IF(Textes!F$2=1,B172,IF(Textes!F$2=2,C172,IF(Textes!F$2=3,D172,\"\")))","v":"dt MS de Fourrages par an"},"dt MS de Fourrages par an","Raufutter in dt TS pro Jahr"]
[{"$f":"IF(Textes!F$2=1,B173,IF(Textes!F$2=2,C173,IF(Textes!F$2=3,D173,\"\")))","v":"Fourrages > 15 % ?"},"Fourrages > 15 % ?","Anteil Raufutter > 15 %?"]
[{"$f":"IF(Textes!F$2=1,B174,IF(Textes!F$2=2,C174,IF(Textes!F$2=3,D174,\"\")))","v":"y. c. fourrages"},"y. c. fourrages","mit Raufutter"]
[{"$f":"IF(Textes!F$2=1,B175,IF(Textes!F$2=2,C175,IF(Textes!F$2=3,D175,\"\")))","v":"sans fourrages"},"sans fourrages","ohne Raufutter"]
[{"$f":"IF(Textes!F$2=1,B176,IF(Textes!F$2=2,C176,IF(Textes!F$2=3,D176,\"\")))","v":"Croît total par an"},"Croît total par an","Zuwachs pro 365 Tage"]
[{"$f":"IF(Textes!F$2=1,B177,IF(Textes!F$2=2,C177,IF(Textes!F$2=3,D177,\"\")))","v":"PPE à partir du croît"},"PPE à partir du croît","MSP nach Zuwachs"]
[{"$f":"IF(Textes!F$2=1,B178,IF(Textes!F$2=2,C178,IF(Textes!F$2=3,D178,\"\")))","v":"Bilan animaux"},"Bilan animaux","Tierbilanz"]
[{"$f":"IF(Textes!F$2=1,B179,IF(Textes!F$2=2,C179,IF(Textes!F$2=3,D179,\"\")))","v":"Nombre"},"Nombre","Anzahl"]
[{"$f":"IF(Textes!F$2=1,B180,IF(Textes!F$2=2,C180,IF(Textes!F$2=3,D180,\"\")))","v":"kg PV"},"kg PV","kg LG"]
[{"$f":"IF(Textes!F$2=1,B181,IF(Textes!F$2=2,C181,IF(Textes!F$2=3,D181,\"\")))","v":"Inventaire début"},"Inventaire début","Anfangsinventar"]
[{"$f":"IF(Textes!F$2=1,B182,IF(Textes!F$2=2,C182,IF(Textes!F$2=3,D182,\"\")))","v":"Entrées"},"Entrées","Zukauf"]
[{"$f":"IF(Textes!F$2=1,B183,IF(Textes!F$2=2,C183,IF(Textes!F$2=3,D183,\"\")))","v":"Sorties"},"Sorties","Ausgang"]
[{"$f":"IF(Textes!F$2=1,B184,IF(Textes!F$2=2,C184,IF(Textes!F$2=3,D184,\"\")))","v":"Inventaire fin"},"Inventaire fin","Endinventar"]
[{"$f":"IF(Textes!F$2=1,B185,IF(Textes!F$2=2,C185,IF(Textes!F$2=3,D185,\"\")))","v":"Période"},"Période","Periode"]
[{"$f":"IF(Textes!F$2=1,B186,IF(Textes!F$2=2,C186,IF(Textes!F$2=3,D186,\"\")))","v":"365 jours"},"365 jours","365 Tage"]
[{"$f":"IF(Textes!F$2=1,B187,IF(Textes!F$2=2,C187,IF(Textes!F$2=3,D187,\"\")))","v":"(Période)"},"(Période)","(Periode)"]
[{"$f":"IF(Textes!F$2=1,B188,IF(Textes!F$2=2,C188,IF(Textes!F$2=3,D188,\"\")))","v":"(365 jours)"},"(365 jours)","(365 Tage)"]
[{"$f":"IF(Textes!F$2=1,B189,IF(Textes!F$2=2,C189,IF(Textes!F$2=3,D189,\"\")))","v":"Bilan"},"Bilan","Bilanz"]
[{"$f":"IF(Textes!F$2=1,B190,IF(Textes!F$2=2,C190,IF(Textes!F$2=3,D190,\"\")))","v":"Bilan total"},"Bilan total","Bilanz aller Tiere"]
[{"$f":"IF(Textes!F$2=1,B191,IF(Textes!F$2=2,C191,IF(Textes!F$2=3,D191,\"\")))","v":"L'exploitant autorise le calcul du Suisse-Bilanz"},"L'exploitant autorise le calcul du Suisse-Bilanz","Der Betriebsleiter ist damit einverstanden, dass das Resultat dieser Berechnung zur Beurteilung der Suisse-Bilanz"]
[{"$f":"IF(Textes!F$2=1,B192,IF(Textes!F$2=2,C192,IF(Textes!F$2=3,D192,\"\")))","v":"avec le résultat de ce bilan import/export"},"avec le résultat de ce bilan import/export","berücksichtigt wird."]
[{"$f":"IF(Textes!F$2=1,B193,IF(Textes!F$2=2,C193,IF(Textes!F$2=3,D193,\"\")))","v":"Exploitant, Date:"},"Exploitant, Date:","Betriebsleiter, Datum:"]
[{"$f":"IF(Textes!F$2=1,B194,IF(Textes!F$2=2,C194,IF(Textes!F$2=3,D194,\"\")))","v":"Organisation de contrôle, Date:"},"Organisation de contrôle, Date:","Kantonale Vollzugsstelle, Datum:"]
[{"$f":"IF(Textes!F$2=1,B195,IF(Textes!F$2=2,C195,IF(Textes!F$2=3,D195,\"\")))","v":"dt MS"},"dt MS","dt TS"]
[{"$f":"IF(Textes!F$2=1,B196,IF(Textes!F$2=2,C196,IF(Textes!F$2=3,D196,\"\")))","v":"1g N = 6.25 g MA"},"1g N = 6.25 g MA","1g N = 6.25 g RP"]
[{"$f":"IF(Textes!F$2=1,B197,IF(Textes!F$2=2,C197,IF(Textes!F$2=3,D197,\"\")))","v":"jours"},"jours","Tage"]
[{"$f":"IF(Textes!F$2=1,B198,IF(Textes!F$2=2,C198,IF(Textes!F$2=3,D198,\"\")))","v":"PPE"},"PPE","MSP"]
[{"$f":"IF(Textes!F$2=1,B199,IF(Textes!F$2=2,C199,IF(Textes!F$2=3,D199,\"\")))","v":"Signature:"},"Signature:","Unterschrift:"]
[{"$f":"IF(Textes!F$2=1,B200,IF(Textes!F$2=2,C200,IF(Textes!F$2=3,D200,\"\")))","v":"< 60 kg PV"},"< 60 kg PV","bis 60 kg LG"]
[{"$f":"IF(Textes!F$2=1,B201,IF(Textes!F$2=2,C201,IF(Textes!F$2=3,D201,\"\")))","v":"> 60 kg PV"},"> 60 kg PV","ab 60 kg LG"]
[{"$f":"IF(Textes!F$2=1,B202,IF(Textes!F$2=2,C202,IF(Textes!F$2=3,D202,\"\")))","v":"Calcul des valeurs minimales"},"Calcul des valeurs minimales","Berechnung der Tiefstwerte"]
[{"$f":"IF(Textes!F$2=1,B203,IF(Textes!F$2=2,C203,IF(Textes!F$2=3,D203,\"\")))","v":"Catégorie d'animaux"},"Catégorie d'animaux","Tierkategorie"]
[{"$f":"IF(Textes!F$2=1,B204,IF(Textes!F$2=2,C204,IF(Textes!F$2=3,D204,\"\")))","v":"Porc à l'engrais/de remonte"},"Porc à l'engrais/de remonte","Mastschweine/Remonten"]
[{"$f":"IF(Textes!F$2=1,B205,IF(Textes!F$2=2,C205,IF(Textes!F$2=3,D205,\"\")))","v":"Porc à l'engrais/de remonte"},"Porc à l'engrais/de remonte","Mastschweine/Remonten"]
[{"$f":"IF(Textes!F$2=1,B206,IF(Textes!F$2=2,C206,IF(Textes!F$2=3,D206,\"\")))","v":"Truie d'élevage avec porcelets < 26 kg PV"},{"$f":" \"Truie d'élevage avec porcelets < \" & E206 & \" kg PV\"","v":"Truie d'élevage avec porcelets < 26 kg PV"},{"$f":" \"Zuchtschweine inkl. Ferkel bis \" & E206 & \" kg LG\"","v":"Zuchtschweine inkl. Ferkel bis 26 kg LG"},null,26]
[{"$f":"IF(Textes!F$2=1,B207,IF(Textes!F$2=2,C207,IF(Textes!F$2=3,D207,\"\")))","v":"Verrat"},"Verrat","Eber"]
[{"$f":"IF(Textes!F$2=1,B208,IF(Textes!F$2=2,C208,IF(Textes!F$2=3,D208,\"\")))","v":"Truie non allaitante"},"Truie non allaitante","Galtsauen"]
[{"$f":"IF(Textes!F$2=1,B209,IF(Textes!F$2=2,C209,IF(Textes!F$2=3,D209,\"\")))","v":"Truie non allaitante"},"Truie non allaitante","Galtsauen"]
[{"$f":"IF(Textes!F$2=1,B210,IF(Textes!F$2=2,C210,IF(Textes!F$2=3,D210,\"\")))","v":"Truie allaitante"},"Truie allaitante","Säugende Zuchtsauen"]
[{"$f":"IF(Textes!F$2=1,B211,IF(Textes!F$2=2,C211,IF(Textes!F$2=3,D211,\"\")))","v":"Truie allaitante"},"Truie allaitante","Säugende Zuchtsauen"]
[{"$f":"IF(Textes!F$2=1,B212,IF(Textes!F$2=2,C212,IF(Textes!F$2=3,D212,\"\")))","v":"Porcelet sevré, d'env. 8 à 26 kg PV"},{"$f":" \"Porcelet sevré, d'env. \" & E212 & \" à \" & F212 & \" kg PV\"","v":"Porcelet sevré, d'env. 8 à 26 kg PV"},{"$f":"\"Abgesetzte Ferkel, von ca. \" & E212 & \" bis \" & F212 & \" kg LG\"","v":"Abgesetzte Ferkel, von ca. 8 bis 26 kg LG"},null,8,{"$f":"E206","v":26}]
[{"$f":"IF(Textes!F$2=1,B213,IF(Textes!F$2=2,C213,IF(Textes!F$2=3,D213,\"\")))","v":"Porcelet sevré, d'env. 8 à 26 kg PV"},{"$f":" \"Porcelet sevré, d'env. \" & E213 & \" à \" & F213 & \" kg PV\"","v":"Porcelet sevré, d'env. 8 à 26 kg PV"},{"$f":"\"Abgesetzte Ferkel, von ca. \" & E213 & \" bis \" & F213 & \" kg LG\"","v":"Abgesetzte Ferkel, von ca. 8 bis 26 kg LG"},null,{"$f":"E212","v":8},{"$f":"F212","v":26}]
[{"$f":"IF(Textes!F$2=1,B214,IF(Textes!F$2=2,C214,IF(Textes!F$2=3,D214,\"\")))","v":"Poulettes"},"Poulettes","Junghennen"]
[{"$f":"IF(Textes!F$2=1,B215,IF(Textes!F$2=2,C215,IF(Textes!F$2=3,D215,\"\")))","v":"Poulets à l'engrais"},"Poulets à l'engrais","Mastpoulets"]
[{"$f":"IF(Textes!F$2=1,B216,IF(Textes!F$2=2,C216,IF(Textes!F$2=3,D216,\"\")))","v":"Dindes à l'engrais"},"Dindes à l'engrais","Masttruten"]
[{"$f":"IF(Textes!F$2=1,B217,IF(Textes!F$2=2,C217,IF(Textes!F$2=3,D217,\"\")))","v":"Dindes avancement"},"Dindes avancement","Trutenvormast"]
[{"$f":"IF(Textes!F$2=1,B218,IF(Textes!F$2=2,C218,IF(Textes!F$2=3,D218,\"\")))","v":"Dindes finition"},"Dindes finition","Trutenausmast"]
[{"$f":"IF(Textes!F$2=1,B219,IF(Textes!F$2=2,C219,IF(Textes!F$2=3,D219,\"\")))","v":"<= 1.5 kg PV, 6 rotations"},{"$f":"\"<= \" &$E219&\" kg PV, \" &$F$219&\" rotations\"","v":"<= 1.5 kg PV, 6 rotations"},{"$f":"\"bis \" &$E219&\" kg LG, \" &$F$219&\" Umtriebe\"","v":"bis 1.5 kg LG, 6 Umtriebe"},null,1.5,6]
[{"$f":"IF(Textes!F$2=1,B220,IF(Textes!F$2=2,C220,IF(Textes!F$2=3,D220,\"\")))","v":"> 1.5 - 13 kg PV, 2.9 rotations"},{"$f":"\"> \" & $E220&\" kg PV, \" &$F$220&\" rotations\"","v":"> 1.5 - 13 kg PV, 2.9 rotations"},{"$f":"$E220&\" kg LG, \" &$F$220&\" Umtriebe\"","v":"1.5 - 13 kg LG, 2.9 Umtriebe"},null,"1.5 - 13",2.9]
[{"$f":"IF(Textes!F$2=1,B221,IF(Textes!F$2=2,C221,IF(Textes!F$2=3,D221,\"\")))","v":"100 places"},"100 places","100 Plätze"]
[{"$f":"IF(Textes!F$2=1,B222,IF(Textes!F$2=2,C222,IF(Textes!F$2=3,D222,\"\")))","v":"100 animaux"},"100 animaux","100 Stück"]
[{"$f":"IF(Textes!F$2=1,B223,IF(Textes!F$2=2,C223,IF(Textes!F$2=3,D223,\"\")))","v":"Lapine mère, y.c. petits < 35 j."},{"$f":"\"Lapine mère, y.c. petits < \" & E223 & \" j.\"","v":"Lapine mère, y.c. petits < 35 j."},{"$f":"\"Produz. Zibben, inkl. Jungtiere bis ca. \" & E223 & \" Tage\"","v":"Produz. Zibben, inkl. Jungtiere bis ca. 35 Tage"},null,35,null,null,null,"\" & BEZUG & \""]
[{"$f":"IF(Textes!F$2=1,B224,IF(Textes!F$2=2,C224,IF(Textes!F$2=3,D224,\"\")))","v":"Lapins d'engraissement > 35 j."},{"$f":"\"Lapins d'engraissement > \" & E224 & \" j.\"","v":"Lapins d'engraissement > 35 j."},{"$f":"\"Kaninchen - Jungtiere, ab ca. \" & E224 & \" Tage\"","v":"Kaninchen - Jungtiere, ab ca. 35 Tage"},null,{"$f":"E223","v":35}]
[{"$f":"IF(Textes!F$2=1,B225,IF(Textes!F$2=2,C225,IF(Textes!F$2=3,D225,\"\")))","v":"Unité"},"Unité","Einheit"]
[{"$f":"IF(Textes!F$2=1,B226,IF(Textes!F$2=2,C226,IF(Textes!F$2=3,D226,\"\")))","v":"Place"},"Place","Platz"]
[{"$f":"IF(Textes!F$2=1,B227,IF(Textes!F$2=2,C227,IF(Textes!F$2=3,D227,\"\")))","v":"Animal"},"Animal","Stück"]
[{"$f":"IF(Textes!F$2=1,B228,IF(Textes!F$2=2,C228,IF(Textes!F$2=3,D228,\"\")))","v":"Définition de l'unité"},"Définition de l'unité","Definition der Einheit"]
[{"$f":"IF(Textes!F$2=1,B229,IF(Textes!F$2=2,C229,IF(Textes!F$2=3,D229,\"\")))","v":"272 kg croît/année ; FV 2.6; 3.32 rotations"},{"$f":" $E229 &\" kg croît/année ; FV \" & $F229 & \"; \" & $G229 & \" rotations\"","v":"272 kg croît/année ; FV 2.6; 3.32 rotations"},{"$f":" $E229 &\" kg Zuwachs/Jahr; FV \" & $F229 & \"; \" & $G229 & \" Umtriebe\"","v":"272 kg Zuwachs/Jahr; FV 2.6; 3.32 Umtriebe"},null,272,2.6,3.32]
[{"$f":"IF(Textes!F$2=1,B230,IF(Textes!F$2=2,C230,IF(Textes!F$2=3,D230,\"\")))","v":"82 kg croît; FV 2.6"},{"$f":" $E230 &\" kg croît; FV \" & $F230","v":"82 kg croît; FV 2.6"},{"$f":" $E230 &\" kg Zuwachs; FV \" & $F230","v":"82 kg Zuwachs; FV 2.6"},null,82,{"$f":"F229","v":2.6}]
[{"$f":"IF(Textes!F$2=1,B231,IF(Textes!F$2=2,C231,IF(Textes!F$2=3,D231,\"\")))","v":"Ø des effectifs début et fin "},"Ø des effectifs début et fin ","Mittelwert Anfangs- und Endbestand"]
[{"$f":"IF(Textes!F$2=1,B232,IF(Textes!F$2=2,C232,IF(Textes!F$2=3,D232,\"\")))","v":"Ø des effectifs début et fin "},"Ø des effectifs début et fin ","Mittelwert Anfangs- und Endbestand"]
[{"$f":"IF(Textes!F$2=1,B233,IF(Textes!F$2=2,C233,IF(Textes!F$2=3,E233,\"\")))","v":"Calcul en fonction des rotations ou des jours d'affouragement, voir remarque"},"Calcul en fonction des rotations ou des jours d'affouragement, voir remarque","Berechnung nach Umtrieben oder Futtertagen, siehe Bemerkung",null,2.94]
[{"$f":"IF(Textes!F$2=1,B234,IF(Textes!F$2=2,C234,IF(Textes!F$2=3,E234,\"\")))","v":"Ø (achats 365 j + sortie 365 j)"},"Ø (achats 365 j + sortie 365 j)","Mittelwert (Zukauf 365d + Ausgang 365d)"]
[{"$f":"IF(Textes!F$2=1,B235,IF(Textes!F$2=2,C235,IF(Textes!F$2=3,#REF!,\"\")))","v":"Ø (achats 365 j + sortie 365 j) divisé par 9.86 rotations"},{"$f":"\"Ø (achats 365 j + sortie 365 j) divisé par \" & E235 & \" rotations\"","v":"Ø (achats 365 j + sortie 365 j) divisé par 9.86 rotations"},{"$f":"\"Mittelwert (Zukauf 365d + Ausgang 365d) geteilt durch \" & E235 & \" Umtr.\"","v":"Mittelwert (Zukauf 365d + Ausgang 365d) geteilt durch 9.86 Umtr."},null,9.86]
[{"$f":"IF(Textes!F$2=1,B236,IF(Textes!F$2=2,C236,IF(Textes!F$2=3,D236,\"\")))","v":"Ø (achats 365 j + sortie 365 j)"},"Ø (achats 365 j + sortie 365 j)","Mittelwert (Zukauf 365d + Ausgang 365d)"]
[{"$f":"IF(Textes!F$2=1,B237,IF(Textes!F$2=2,C237,IF(Textes!F$2=3,D237,\"\")))","v":"173 kg croît/année ; FV 1.68; 9.61 rotations"},{"$f":" $E237 &\" kg croît/année ; FV \" & $F237 & \"; \" & $G237 & \" rotations\"","v":"173 kg croît/année ; FV 1.68; 9.61 rotations"},{"$f":" $E237 &\" kg Zuwachs/Jahr; FV \" & $F237 & \"; \" & $G237 & \" Umtriebe\"","v":"173 kg Zuwachs/Jahr; FV 1.68; 9.61 Umtriebe"},null,173,1.68,9.61]
[{"$f":"IF(Textes!F$2=1,B238,IF(Textes!F$2=2,C238,IF(Textes!F$2=3,D238,\"\")))","v":"18 kg croît; FV 1.68"},{"$f":" $E238 &\" kg croît; FV \" & $F238","v":"18 kg croît; FV 1.68"},{"$f":" $E238 &\" kg Zuwachs; FV \" & $F238","v":"18 kg Zuwachs; FV 1.68"},null,18,{"$f":"F237","v":1.68}]
[{"$f":"IF(Textes!F$2=1,B239,IF(Textes!F$2=2,C239,IF(Textes!F$2=3,D239,\"\")))","v":"Moyenne des poulettes; 2.25 rotations"},{"$f":" \"Moyenne des poulettes; \" & E239 & \" rotations\"","v":"Moyenne des poulettes; 2.25 rotations"},{"$f":"\"Im Durchschnitt gehaltene Junghennen; \" & E239 & \" Umtriebe\"","v":"Im Durchschnitt gehaltene Junghennen; 2.25 Umtriebe"},null,2.25]
[{"$f":"IF(Textes!F$2=1,B240,IF(Textes!F$2=2,C240,IF(Textes!F$2=3,D240,\"\")))","v":"Effectif moyen des poulets à l'engrais pour l'éval. des valeurs minimales"},"Effectif moyen des poulets à l'engrais pour l'éval. des valeurs minimales","Durchschnittsbestand für Beurteilung Tiefstwerte"]
[{"$f":"IF(Textes!F$2=1,B241,IF(Textes!F$2=2,C241,IF(Textes!F$2=3,D241,\"\")))","v":"Moyenne des dindes à l'engrais; 2.8 rotations"},{"$f":" \"Moyenne des dindes à l'engrais; \" & E241 & \" rotations\"","v":"Moyenne des dindes à l'engrais; 2.8 rotations"},{"$f":" \"Im Durchschnitt gehaltene Masttruten; \" & E241 & \" Umtriebe\"","v":"Im Durchschnitt gehaltene Masttruten; 2.8 Umtriebe"},null,2.8]
[{"$f":"IF(Textes!F$2=1,B242,IF(Textes!F$2=2,C242,IF(Textes!F$2=3,D242,\"\")))","v":"Moyenne des lapins mère"},"Moyenne des lapins mère","Im Durchschnitt gehaltene Zibben"]
[{"$f":"IF(Textes!F$2=1,B243,IF(Textes!F$2=2,C243,IF(Textes!F$2=3,D243,\"\")))","v":"Moyenne des lapins d'engraissement"},"Moyenne des lapins d'engraissement","Im Durchschnitt gehaltene Mastkaninchen"]
[{"$f":"IF(Textes!F$2=1,B244,IF(Textes!F$2=2,C244,IF(Textes!F$2=3,D244,\"\")))","v":"Remarques pour le calcul du cheptel moyen chez les porcs :"},"Remarques pour le calcul du cheptel moyen chez les porcs :","Bemerkungen zur Berechnung der Durchschnittsbestände bei Schweinen"]
[{"$f":"IF(Textes!F$2=1,B245,IF(Textes!F$2=2,C245,IF(Textes!F$2=3,D245,\"\")))","v":"      Remarque :"},"      Remarque :","      Kommentar:"]
[{"$f":"IF(Textes!F$2=1,B246,IF(Textes!F$2=2,C246,IF(Textes!F$2=3,D246,\"\")))","v":"- Les exploitations mixtes tiennent compte pour les porcs à l'engrais d'une croissance de 272 kg, de l'inventaire, de leur propre remonte,"},{"$f":"\"- Les exploitations mixtes tiennent compte pour les porcs à l'engrais d'une croissance de \"  & E246 & \" kg, de l'inventaire, de leur propre remonte,\"","v":"- Les exploitations mixtes tiennent compte pour les porcs à l'engrais d'une croissance de 272 kg, de l'inventaire, de leur propre remonte,"},{"$f":" \"- Kombinierte Betriebe berücksichtigen bei den Mastschweinen neben einem Zuwachs von \" & E246 & \" kg das Inventar und die eigene Remontierung\"","v":"- Kombinierte Betriebe berücksichtigen bei den Mastschweinen neben einem Zuwachs von 272 kg das Inventar und die eigene Remontierung"},null,{"$f":"E229","v":272}]
[{"$f":"IF(Textes!F$2=1,B247,IF(Textes!F$2=2,C247,IF(Textes!F$2=3,D247,\"\")))","v":" ainsi que d'éventuels porcelets en surpoids (=> tous les croîts entre 26 et 108 kg PV)."},{"$f":" \" ainsi que d'éventuels porcelets en surpoids (=> tous les croîts entre \" & E247 & \" et \" & F247 & \" kg PV).\"","v":" ainsi que d'éventuels porcelets en surpoids (=> tous les croîts entre 26 et 108 kg PV)."},{"$f":" \" sowie allfällige übergewichtige Ferkel (=> sämtlicher Zuwachs zwischen \" & E247 & \" und \" & F247 & \" kg LG)\"","v":" sowie allfällige übergewichtige Ferkel (=> sämtlicher Zuwachs zwischen 26 und 108 kg LG)"},null,{"$f":"E206","v":26},108]
[{"$f":"IF(Textes!F$2=1,B248,IF(Textes!F$2=2,C248,IF(Textes!F$2=3,D248,\"\")))","v":"- Places truie d'élevage et places verrat: des éventuelles fluctuations annuelles justifient un écart de la moyenne des cheptels début et fin."},"- Places truie d'élevage et places verrat: des éventuelles fluctuations annuelles justifient un écart de la moyenne des cheptels début et fin.","- Zuchtschweineplätze und Eberplätze: Allfällige Jahresschwankungen rechtfertigen eine Abweichung vom Mittelwert des Anfangs- und Endbestandes"]
[{"$f":"IF(Textes!F$2=1,B249,IF(Textes!F$2=2,C249,IF(Textes!F$2=3,D249,\"\")))","v":"- Places truie non allaitante : nombre de places calculé en fonction de rotations: valeur moyenne (achats 365 j + sortie 365 j) divisée par 2.94 rotations"},{"$f":"\"- Places truie non allaitante : nombre de places calculé en fonction de rotations: valeur moyenne (achats 365 j + sortie 365 j) divisée par \" & E233 &\" rotations\"","v":"- Places truie non allaitante : nombre de places calculé en fonction de rotations: valeur moyenne (achats 365 j + sortie 365 j) divisée par 2.94 rotations"},{"$f":"\"- AFP Galtsauen: Anzahl Plätze berechnet nach Umtrieben: Mittelwert (Zukauf 365d + Ausgang 365d) geteilt durch \" & E233  & \" Umtriebe\"","v":"- AFP Galtsauen: Anzahl Plätze berechnet nach Umtrieben: Mittelwert (Zukauf 365d + Ausgang 365d) geteilt durch 2.94 Umtriebe"}]
[{"$f":"IF(Textes!F$2=1,B250,IF(Textes!F$2=2,C250,IF(Textes!F$2=3,D250,\"\")))","v":"       ou par les jours d’affouragement. Le cheptel moyen peut atteindre au plus la moyenne des animaux en stabulation."},"       ou par les jours d’affouragement. Le cheptel moyen peut atteindre au plus la moyenne des animaux en stabulation.","         oder nach Futtertagen. Die durchschnittliche Anzahl Plätze kann maximal der Anzahl Stallplätze entsprechen."]
[{"$f":"IF(Textes!F$2=1,B251,IF(Textes!F$2=2,C251,IF(Textes!F$2=3,D251,\"\")))","v":"       Augmentation de poids entre entrée et sortie des animaux: valeur standard 35 kg (y. c. remontes et truites de réforme) ou peser tous les animaux."},{"$f":"\"       Augmentation de poids entre entrée et sortie des animaux: valeur standard \" & E251 & \" kg (y. c. remontes et truites de réforme) ou peser tous les animaux.\"","v":"       Augmentation de poids entre entrée et sortie des animaux: valeur standard 35 kg (y. c. remontes et truites de réforme) ou peser tous les animaux."},{"$f":"\"         Gewichtszunahme zwischen Tiereingang und Tierausgang: standardmässig \" & E251 & \" kg (inkl. Remonten und Schlachtmoren) oder Wägung aller Tiere.\"","v":"         Gewichtszunahme zwischen Tiereingang und Tierausgang: standardmässig 35 kg (inkl. Remonten und Schlachtmoren) oder Wägung aller Tiere."},null,35]
[{"$f":"IF(Textes!F$2=1,B252,IF(Textes!F$2=2,C252,IF(Textes!F$2=3,D252,\"\")))","v":"- Places truie allaitante: nombre de places calculé en fonction de rotations: valeur moyenne (achats 365 j + sortie 365 j) divisée par 9.86 rotations"},{"$f":"\"- Places truie allaitante: nombre de places calculé en fonction de rotations: valeur moyenne (achats 365 j + sortie 365 j) divisée par \" & E235 &\" rotations\"","v":"- Places truie allaitante: nombre de places calculé en fonction de rotations: valeur moyenne (achats 365 j + sortie 365 j) divisée par 9.86 rotations"},{"$f":"\"- AFP Säugende Zuchtschweine: Anzahl Plätze berechnet nach Umtrieben: Mittelwert (Zukauf 365 d + Ausgang 365 d) geteilt durch \" & E235 & \" Umtriebe\"","v":"- AFP Säugende Zuchtschweine: Anzahl Plätze berechnet nach Umtrieben: Mittelwert (Zukauf 365 d + Ausgang 365 d) geteilt durch 9.86 Umtriebe"}]
[{"$f":"IF(Textes!F$2=1,B253,IF(Textes!F$2=2,C253,IF(Textes!F$2=3,D253,\"\")))","v":"       ou par les jours d’affouragement. Le cheptel moyen peut atteindre au plus la moyenne des animaux en stabulation."},"       ou par les jours d’affouragement. Le cheptel moyen peut atteindre au plus la moyenne des animaux en stabulation.","         oder nach Futtertagen. Die durchschnittliche Anzahl Plätze kann maximal der Anzahl Stallplätze entsprechen."]
[{"$f":"IF(Textes!F$2=1,B254,IF(Textes!F$2=2,C254,IF(Textes!F$2=3,D254,\"\")))","v":"       Diminution de poids entre entrée et sortie des animaux: valeur standard 35 kg (y. c. remontes et truites de réforme) ou peser tous les animaux."},{"$f":"\"       Diminution de poids entre entrée et sortie des animaux: valeur standard \" & E254 & \" kg (y. c. remontes et truites de réforme) ou peser tous les animaux.\"","v":"       Diminution de poids entre entrée et sortie des animaux: valeur standard 35 kg (y. c. remontes et truites de réforme) ou peser tous les animaux."},{"$f":"\"         Gewichtsabnahme zwischen Tiereingang und Tierausgang: standardmässig \" & E254 & \" kg (inkl. Remonten und Schlachtmoren) oder Wägung aller Tiere.\"","v":"         Gewichtsabnahme zwischen Tiereingang und Tierausgang: standardmässig 35 kg (inkl. Remonten und Schlachtmoren) oder Wägung aller Tiere."},null,{"$f":"E251","v":35}]
[{"$f":"IF(Textes!F$2=1,B255,IF(Textes!F$2=2,C255,IF(Textes!F$2=3,D255,\"\")))","v":"- Les exploitations de mise bas avec élevage tiennent compte d'un croît de 173 kg et de l'inventaire"},{"$f":"\"- Les exploitations de mise bas avec élevage tiennent compte d'un croît de \" & E255 & \" kg et de l'inventaire\"","v":"- Les exploitations de mise bas avec élevage tiennent compte d'un croît de 173 kg et de l'inventaire"},{"$f":"\"- AFP Abferkelbetrieb mit Ferkelaufzucht berücksichtigen neben dem Zuwachs von \" & E255 & \" kg auch das Inventar\"","v":"- AFP Abferkelbetrieb mit Ferkelaufzucht berücksichtigen neben dem Zuwachs von 173 kg auch das Inventar"},null,{"$f":"E237","v":173},{"$f":"E212","v":8},{"$f":"E206","v":26}]
[{"$f":"IF(Textes!F$2=1,B256,IF(Textes!F$2=2,C256,IF(Textes!F$2=3,D256,\"\")))","v":"        (=> tous les croîts entre 8 et 26 kg PV)."},{"$f":"\"        (=> tous les croîts entre \" & F255 & \" et \" & G255 & \" kg PV).\"","v":"        (=> tous les croîts entre 8 et 26 kg PV)."},{"$f":"\"        (=> sämtlicher Zuwachs zwischen \"&F255&\" und \"&G255&\" kg LG)\"","v":"        (=> sämtlicher Zuwachs zwischen 8 und 26 kg LG)"}]
[{"$f":"IF(Textes!F$2=1,B257,IF(Textes!F$2=2,C257,IF(Textes!F$2=3,D257,\"\")))","v":"Nombre"},"Nombre","Anzahl"]
[{"$f":"IF(Textes!F$2=1,B258,IF(Textes!F$2=2,C258,IF(Textes!F$2=3,D258,\"\")))","v":"N"},"N","N"]
[{"$f":"IF(Textes!F$2=1,B259,IF(Textes!F$2=2,C259,IF(Textes!F$2=3,D259,\"\")))","v":"Nstock"},"Nstock","Nges"]
[{"$f":"IF(Textes!F$2=1,B260,IF(Textes!F$2=2,C260,IF(Textes!F$2=3,D260,\"\")))","v":"P2O5"},"P2O5","P2O5"]
[{"$f":"IF(Textes!F$2=1,B261,IF(Textes!F$2=2,C261,IF(Textes!F$2=3,D261,\"\")))","v":"Nstock"},"Nstock","Nges"]
[{"$f":"IF(Textes!F$2=1,B262,IF(Textes!F$2=2,C262,IF(Textes!F$2=3,D262,\"\")))","v":"P2O5"},"P2O5","P2O5"]
[{"$f":"IF(Textes!F$2=1,B263,IF(Textes!F$2=2,C263,IF(Textes!F$2=3,D263,\"\")))","v":"Valeur minimale pour l'exploitation"},"Valeur minimale pour l'exploitation","Tiefstwert für den Betrieb"]
[{"$f":"IF(Textes!F$2=1,B264,IF(Textes!F$2=2,C264,IF(Textes!F$2=3,D264,\"\")))","v":"Valeur calculée par le bilan import/export"},"Valeur calculée par le bilan import/export","Berechneter Wert aus Import/Export Bilanz"]
[{"$f":"IF(Textes!F$2=1,B265,IF(Textes!F$2=2,C265,IF(Textes!F$2=3,D265,\"\")))","v":"Valeur à reporter dans le Suisse-Bilanz"},"Valeur à reporter dans le Suisse-Bilanz","Uebertrag in die Suisse-Bilanz"]
[{"$f":"IF(Textes!F$2=1,B266,IF(Textes!F$2=2,C266,IF(Textes!F$2=3,D266,\"\")))","v":"Total"},"Total","Total"]
[{"$f":"IF(Textes!F$2=1,B267,IF(Textes!F$2=2,C267,IF(Textes!F$2=3,D267,\"\")))","v":"Poulailler 1"},"Poulailler 1","Stall 1"]
[{"$f":"IF(Textes!F$2=1,B268,IF(Textes!F$2=2,C268,IF(Textes!F$2=3,D268,\"\")))","v":"Poulailler 2"},"Poulailler 2","Stall 2"]
[{"$f":"IF(Textes!F$2=1,B269,IF(Textes!F$2=2,C269,IF(Textes!F$2=3,D269,\"\")))","v":"Poulailler 3"},"Poulailler 3","Stall 3"]
[{"$f":"IF(Textes!F$2=1,B270,IF(Textes!F$2=2,C270,IF(Textes!F$2=3,D270,\"\")))","v":" Achat et vente transférés dans A1a et A2a"}," Achat et vente transférés dans A1a et A2a","Zu- und Verkäufe nach A1a und A2a übertragen"]
[{"$f":"IF(Textes!F$2=1,B271,IF(Textes!F$2=2,C271,IF(Textes!F$2=3,D271,\"\")))","v":" Achat et vente transférés dans A1b et A2b"}," Achat et vente transférés dans A1b et A2b","Zu- und Verkäufe nach A1b und A2b übertragen"]
[{"$f":"IF(Textes!F$2=1,B272,IF(Textes!F$2=2,C272,IF(Textes!F$2=3,D272,\"\")))","v":" Achat et vente transférés dans A1c et A2c"}," Achat et vente transférés dans A1c et A2c","Zu- und Verkäufe nach A1c und A2c übertragen"]
[{"$f":"IF(Textes!F$2=1,B273,IF(Textes!F$2=2,C273,IF(Textes!F$2=3,D273,\"\")))","v":"Attention: "},"Attention: ","Achtung: "]
[{"$f":"IF(Textes!F$2=1,B274,IF(Textes!F$2=2,C274,IF(Textes!F$2=3,D274,\"\")))","v":"               Travaux commencés avant la période et non terminés pendant la période sont à saisir entièrement !"},"               Travaux commencés avant la période et non terminés pendant la période sont à saisir entièrement !","               Vor der Periode angefangene und nicht innert der Periode abgeschlossene Umtriebe sind ganz zu erfassen!"]
[{"$f":"IF(Textes!F$2=1,B275,IF(Textes!F$2=2,C275,IF(Textes!F$2=3,D275,\"\")))","v":"Date"},"Date","Datum"]
[{"$f":"IF(Textes!F$2=1,B276,IF(Textes!F$2=2,C276,IF(Textes!F$2=3,D276,\"\")))","v":"Nombre d'animaux"},"Nombre d'animaux","Anzahl Tiere"]
[{"$f":"IF(Textes!F$2=1,B277,IF(Textes!F$2=2,C277,IF(Textes!F$2=3,D277,\"\")))","v":"kg PV total"},"kg PV total","kg LG total"]
[{"$f":"IF(Textes!F$2=1,B278,IF(Textes!F$2=2,C278,IF(Textes!F$2=3,D278,\"\")))","v":"Jours "},"Jours "]
[{"$f":"IF(Textes!F$2=1,B279,IF(Textes!F$2=2,C279,IF(Textes!F$2=3,D279,\"\")))","v":"d'engrais-"},"d'engrais-"]
[{"$f":"IF(Textes!F$2=1,B280,IF(Textes!F$2=2,C280,IF(Textes!F$2=3,D280,\"\")))","v":"sement"},"sement","Masttage"]
[{"$f":"IF(Textes!F$2=1,B281,IF(Textes!F$2=2,C281,IF(Textes!F$2=3,D281,\"\")))","v":"Coefficient"},"Coefficient","Faktor"]
[{"$f":"IF(Textes!F$2=1,B282,IF(Textes!F$2=2,C282,IF(Textes!F$2=3,D282,\"\")))","v":"Nbre d'ani-"},"Nbre d'ani-","Anzahl ge-"]
[{"$f":"IF(Textes!F$2=1,B283,IF(Textes!F$2=2,C283,IF(Textes!F$2=3,D283,\"\")))","v":"maux abattus"},"maux abattus","schlachtete"]
[{"$f":"IF(Textes!F$2=1,B284,IF(Textes!F$2=2,C284,IF(Textes!F$2=3,D284,\"\")))","v":"x coefficient"},"x coefficient","Tiere x Faktor"]
[{"$f":"IF(Textes!F$2=1,B285,IF(Textes!F$2=2,C285,IF(Textes!F$2=3,D285,\"\")))","v":"Nombre déter-"},"Nombre déter-","Massgebende"]
[{"$f":"IF(Textes!F$2=1,B286,IF(Textes!F$2=2,C286,IF(Textes!F$2=3,D286,\"\")))","v":"minant d'animaux"},"minant d'animaux","Anzahl Tiere"]
[{"$f":"IF(Textes!F$2=1,B287,IF(Textes!F$2=2,C287,IF(Textes!F$2=3,D287,\"\")))","v":"par rotation"},"par rotation","je Umtrieb"]
[{"$f":"IF(Textes!F$2=1,B288,IF(Textes!F$2=2,C288,IF(Textes!F$2=3,D288,\"\")))","v":"pour valeurs"},"pour valeurs","für Tiefst-"]
[{"$f":"IF(Textes!F$2=1,B289,IF(Textes!F$2=2,C289,IF(Textes!F$2=3,D289,\"\")))","v":"minimales (vm)"},"minimales (vm)","werte (TW)"]
[{"$f":"IF(Textes!F$2=1,B290,IF(Textes!F$2=2,C290,IF(Textes!F$2=3,D290,\"\")))","v":"pour vm"},"pour vm","für TW"]
[{"$f":"IF(Textes!F$2=1,B291,IF(Textes!F$2=2,C291,IF(Textes!F$2=3,D291,\"\")))","v":"Rotation 1"},"Rotation 1","Umtrieb 1"]
[{"$f":"IF(Textes!F$2=1,B292,IF(Textes!F$2=2,C292,IF(Textes!F$2=3,D292,\"\")))","v":"Rotation 2"},"Rotation 2","Umtrieb 2"]
[{"$f":"IF(Textes!F$2=1,B293,IF(Textes!F$2=2,C293,IF(Textes!F$2=3,D293,\"\")))","v":"Rotation 3"},"Rotation 3","Umtrieb 3"]
[{"$f":"IF(Textes!F$2=1,B294,IF(Textes!F$2=2,C294,IF(Textes!F$2=3,D294,\"\")))","v":"Rotation 4"},"Rotation 4","Umtrieb 4"]
[{"$f":"IF(Textes!F$2=1,B295,IF(Textes!F$2=2,C295,IF(Textes!F$2=3,D295,\"\")))","v":"Rotation 5"},"Rotation 5","Umtrieb 5"]
[{"$f":"IF(Textes!F$2=1,B296,IF(Textes!F$2=2,C296,IF(Textes!F$2=3,D296,\"\")))","v":"Rotation 6"},"Rotation 6","Umtrieb 6"]
[{"$f":"IF(Textes!F$2=1,B297,IF(Textes!F$2=2,C297,IF(Textes!F$2=3,D297,\"\")))","v":"Rotation 7"},"Rotation 7","Umtrieb 7"]
[{"$f":"IF(Textes!F$2=1,B298,IF(Textes!F$2=2,C298,IF(Textes!F$2=3,D298,\"\")))","v":"Rotation 8"},"Rotation 8","Umtrieb 8"]
[{"$f":"IF(Textes!F$2=1,B299,IF(Textes!F$2=2,C299,IF(Textes!F$2=3,D299,\"\")))","v":"Rotation 9"},"Rotation 9","Umtrieb 9"]
[{"$f":"IF(Textes!F$2=1,B300,IF(Textes!F$2=2,C300,IF(Textes!F$2=3,D300,\"\")))","v":"Rotation 10"},"Rotation 10","Umtrieb 10"]
[{"$f":"IF(Textes!F$2=1,B301,IF(Textes!F$2=2,C301,IF(Textes!F$2=3,D301,\"\")))","v":"Rotation 11"},"Rotation 11","Umtrieb 11"]
[{"$f":"IF(Textes!F$2=1,B302,IF(Textes!F$2=2,C302,IF(Textes!F$2=3,D302,\"\")))","v":"Rotation 12"},"Rotation 12","Umtrieb 12"]
[{"$f":"IF(Textes!F$2=1,B303,IF(Textes!F$2=2,C303,IF(Textes!F$2=3,D303,\"\")))","v":"Mise en poulailler"},"Mise en poulailler","Einstallung"]
[{"$f":"IF(Textes!F$2=1,B304,IF(Textes!F$2=2,C304,IF(Textes!F$2=3,D304,\"\")))","v":"1er abattage"},"1er abattage","1. Schlachtung"]
[{"$f":"IF(Textes!F$2=1,B305,IF(Textes!F$2=2,C305,IF(Textes!F$2=3,D305,\"\")))","v":"2e abattage"},"2e abattage","2. Schlachtung"]
[{"$f":"IF(Textes!F$2=1,B306,IF(Textes!F$2=2,C306,IF(Textes!F$2=3,D306,\"\")))","v":"3e abattage"},"3e abattage","3. Schlachtung"]
[{"$f":"IF(Textes!F$2=1,B307,IF(Textes!F$2=2,C307,IF(Textes!F$2=3,D307,\"\")))","v":"4e abattage"},"4e abattage","4. Schlachtung"]
[{"$f":"IF(Textes!F$2=1,B308,IF(Textes!F$2=2,C308,IF(Textes!F$2=3,D308,\"\")))","v":"5e abattage"},"5e abattage","5. Schlachtung"]
[{"$f":"IF(Textes!F$2=1,B309,IF(Textes!F$2=2,C309,IF(Textes!F$2=3,D309,\"\")))","v":"pertes"},"pertes","Abgänge"]
[{"$f":"IF(Textes!F$2=1,B310,IF(Textes!F$2=2,C310,IF(Textes!F$2=3,D310,\"\")))","v":"pertes en %"},"pertes en %","Abgänge in %",null,"Umtriebe"]
[{"$f":"IF(Textes!F$2=1,B311,IF(Textes!F$2=2,C311,IF(Textes!F$2=3,D311,\"\")))","v":"Rotations"},"Rotations","Umtriebe"]
[{"$f":"IF(Textes!F$2=1,B312,IF(Textes!F$2=2,C312,IF(Textes!F$2=3,D312,\"\")))","v":"jours poulailler occupé"},"jours poulailler occupé","Tage Stall belegt"]
[{"$f":"IF(Textes!F$2=1,B313,IF(Textes!F$2=2,C313,IF(Textes!F$2=3,D313,\"\")))","v":"jours poulailler inoccupé"},"jours poulailler inoccupé","Tage Stall leer"]
[{"$f":"IF(Textes!F$2=1,B314,IF(Textes!F$2=2,C314,IF(Textes!F$2=3,D314,\"\")))","v":"Effectif moyen"},"Effectif moyen","Durchschnittlicher Bestand"]
[{"$f":"IF(Textes!F$2=1,B315,IF(Textes!F$2=2,C315,IF(Textes!F$2=3,D315,\"\")))","v":"en nombre déterminant"},"en nombre déterminant","in massgebenden Stück"]
[{"$f":"IF(Textes!F$2=1,B316,IF(Textes!F$2=2,C316,IF(Textes!F$2=3,D316,\"\")))","v":"en unités de la période"},"en unités de la période","in Stück in der Periode"]
[{"$f":"IF(Textes!F$2=1,B317,IF(Textes!F$2=2,C317,IF(Textes!F$2=3,D317,\"\")))","v":"Nombre de rotations"},"Nombre de rotations","Anzahl Umtriebe"]
[{"$f":"IF(Textes!F$2=1,B318,IF(Textes!F$2=2,C318,IF(Textes!F$2=3,D318,\"\")))","v":"Durée d'occupation"},"Durée d'occupation","Belegungsdauer"]
[{"$f":"IF(Textes!F$2=1,B319,IF(Textes!F$2=2,C319,IF(Textes!F$2=3,D319,\"\")))","v":"par rotation"},"par rotation"," je Umtrieb"]
[{"$f":"IF(Textes!F$2=1,B320,IF(Textes!F$2=2,C320,IF(Textes!F$2=3,D320,\"\")))","v":"Durée d'occupation"},"Durée d'occupation","Belegungsdauer"]
[{"$f":"IF(Textes!F$2=1,B321,IF(Textes!F$2=2,C321,IF(Textes!F$2=3,D321,\"\")))","v":"totale"},"totale","total"]
[{"$f":"IF(Textes!F$2=1,B322,IF(Textes!F$2=2,C322,IF(Textes!F$2=3,D322,\"\")))","v":"Durée d'occupation"},"Durée d'occupation","Minimale jährliche"]
[{"$f":"IF(Textes!F$2=1,B323,IF(Textes!F$2=2,C323,IF(Textes!F$2=3,D323,\"\")))","v":"minimale par an"},"minimale par an","Belegungsdauer"]
[{"$f":"IF(Textes!F$2=1,B324,IF(Textes!F$2=2,C324,IF(Textes!F$2=3,D324,\"\")))","v":"Durée d'occupation"},"Durée d'occupation","Minimale Belegungs-"]
[{"$f":"IF(Textes!F$2=1,B325,IF(Textes!F$2=2,C325,IF(Textes!F$2=3,D325,\"\")))","v":"minimale par periode"},"minimale par periode","dauer pro Periode"]
[{"$f":"IF(Textes!F$2=1,B326,IF(Textes!F$2=2,C326,IF(Textes!F$2=3,D326,\"\")))","v":"(moyenne, sans interruption entre "},"(moyenne, sans interruption entre ","(Durchschnitt, ohne Leerzeit zwischen"]
[{"$f":"IF(Textes!F$2=1,B327,IF(Textes!F$2=2,C327,IF(Textes!F$2=3,D327,\"\")))","v":"les rotations)"},"les rotations)","den Umtrieben)"]
[{"$f":"IF(Textes!F$2=1,B328,IF(Textes!F$2=2,C328,IF(Textes!F$2=3,D328,\"\")))","v":"(nombre total de jours, sans interruption entre"},"(nombre total de jours, sans interruption entre","(Total Tage, ohne Leerzeit zwischen"]
[{"$f":"IF(Textes!F$2=1,B329,IF(Textes!F$2=2,C329,IF(Textes!F$2=3,D329,\"\")))","v":"les rotations)"},"les rotations)","den Umtrieben)"]
[{"$f":"IF(Textes!F$2=1,B330,IF(Textes!F$2=2,C330,IF(Textes!F$2=3,D330,\"\")))","v":"(durée d'occupation minimale"},"(durée d'occupation minimale","(minimale Belegungsdauer"]
[{"$f":"IF(Textes!F$2=1,B331,IF(Textes!F$2=2,C331,IF(Textes!F$2=3,D331,\"\")))","v":"pour une utilisation normale du poulailler)"},"pour une utilisation normale du poulailler)","bei normaler Stallnutzung)"]
[{"$f":"IF(Textes!F$2=1,B332,IF(Textes!F$2=2,C332,IF(Textes!F$2=3,D332,\"\")))","v":"calculée pour la periode)"},"calculée pour la periode)","umgerechnet auf die Periode)"]
[{"$f":"IF(Textes!F$2=1,B333,IF(Textes!F$2=2,C333,IF(Textes!F$2=3,D333,\"\")))","v":"au poulailler 1"},"au poulailler 1","Stall 1"]
[{"$f":"IF(Textes!F$2=1,B334,IF(Textes!F$2=2,C334,IF(Textes!F$2=3,D334,\"\")))","v":"au poulailler 2"},"au poulailler 2","Stall 2"]
[{"$f":"IF(Textes!F$2=1,B335,IF(Textes!F$2=2,C335,IF(Textes!F$2=3,D335,\"\")))","v":"au poulailler 3"},"au poulailler 3","Stall 3"]
[{"$f":"IF(Textes!F$2=1,B336,IF(Textes!F$2=2,C336,IF(Textes!F$2=3,D336,\"\")))","v":"correspond à l'effectif exprimé en UGB"},"correspond à l'effectif exprimé en UGB","entspricht Bestand in GVE"]
[{"$f":"IF(Textes!F$2=1,B337,IF(Textes!F$2=2,C337,IF(Textes!F$2=3,D337,\"\")))","v":"page 1"},"page 1","Seite 1"]
[{"$f":"IF(Textes!F$2=1,B338,IF(Textes!F$2=2,C338,IF(Textes!F$2=3,D338,\"\")))","v":"page 2"},"page 2","Seite 2"]
[{"$f":"IF(Textes!F$2=1,B339,IF(Textes!F$2=2,C339,IF(Textes!F$2=3,D339,\"\")))","v":"page 3"},"page 3","Seite 3"]
[{"$f":"IF(Textes!F$2=1,B340,IF(Textes!F$2=2,C340,IF(Textes!F$2=3,D340,\"\")))","v":"Sommaire poulets"},"Sommaire poulets","Poulets Zusammenfassung"]
[{"$f":"IF(Textes!F$2=1,B341,IF(Textes!F$2=2,C341,IF(Textes!F$2=3,D341,\"\")))","v":"Nombre total d'animaux déterminant"},"Nombre total d'animaux déterminant","Zusammenzug massgebende Stück"]
[{"$f":"IF(Textes!F$2=1,B342,IF(Textes!F$2=2,C342,IF(Textes!F$2=3,D342,\"\")))","v":"pendant la période"},"pendant la période","in der Periode"]
[{"$f":"IF(Textes!F$2=1,B343,IF(Textes!F$2=2,C343,IF(Textes!F$2=3,D343,\"\")))","v":"Période"},"Période","Periode:"]
[{"$f":"IF(Textes!F$2=1,B344,IF(Textes!F$2=2,C344,IF(Textes!F$2=3,D344,\"\")))","v":"No cantonal de l'exploitation"},"No cantonal de l'exploitation","Betriebsnummer:"]
[{"$f":"IF(Textes!F$2=1,B345,IF(Textes!F$2=2,C345,IF(Textes!F$2=3,D345,\"\")))","v":"Prénom, nom"},"Prénom, nom","Vorname, Name:"]
[{"$f":"IF(Textes!F$2=1,B346,IF(Textes!F$2=2,C346,IF(Textes!F$2=3,D346,\"\")))","v":"Adresse"},"Adresse","Adresse:"]
[{"$f":"IF(Textes!F$2=1,B347,IF(Textes!F$2=2,C347,IF(Textes!F$2=3,D347,\"\")))","v":"NPA, lieu"},"NPA, lieu","PLZ, Ort:"]
[{"$f":"IF(Textes!F$2=1,B348,IF(Textes!F$2=2,C348,IF(Textes!F$2=3,D348,\"\")))","v":"Nombre de poulaillers occupés"},"Nombre de poulaillers occupés","Anzahl belegte Ställe"]
[{"$f":"IF(Textes!F$2=1,B349,IF(Textes!F$2=2,C349,IF(Textes!F$2=3,D349,\"\")))","v":"Effectif moyen selon l'OPD"},"Effectif moyen selon l'OPD","Durchschnittsbestand nach DZV"]
[{"$f":"IF(Textes!F$2=1,B350,IF(Textes!F$2=2,C350,IF(Textes!F$2=3,D350,\"\")))","v":"Effectif moyen pour l'évaluation des valeurs minimales"},"Effectif moyen pour l'évaluation des valeurs minimales","Durchschnittsbestand für Beurteilung Tiefstwerte"]
[{"$f":"IF(Textes!F$2=1,B351,IF(Textes!F$2=2,C351,IF(Textes!F$2=3,D351,\"\")))","v":"Si la période correspond à l'année civile, alors l'effectif moyen selon l'OPD"},"Si la période correspond à l'année civile, alors l'effectif moyen selon l'OPD","Wenn die Periode dem Kalenderjahr entspricht, dann muss der Durchschnitts-"]
[{"$f":"IF(Textes!F$2=1,B352,IF(Textes!F$2=2,C352,IF(Textes!F$2=3,D352,\"\")))","v":"doit être déclaré lors du relevé des structures agricoles."},"doit être déclaré lors du relevé des structures agricoles.","bestand nach DZV bei der Betriebsstrukturerhebung deklariert werden."]
[{"$f":"IF(Textes!F$2=1,B353,IF(Textes!F$2=2,C353,IF(Textes!F$2=3,D353,\"\")))","v":"L'effectif moyen pour l'évaluation des valeurs minimales tient compte de la production plus"},"L'effectif moyen pour l'évaluation des valeurs minimales tient compte de la production plus","Der Durchschnittsbestand für die Beurteilung der Tiefstwerte berücksichtigt"]
[{"$f":"IF(Textes!F$2=1,B354,IF(Textes!F$2=2,C354,IF(Textes!F$2=3,D354,\"\")))","v":"faible de nutriments chez les animaux dont la durée d'engraissement est plus courte."},"faible de nutriments chez les animaux dont la durée d'engraissement est plus courte.","den tieferen Nährstoffanfall bei Tieren mit kürzerer Mastdauer."]
[{"$f":"IF(Textes!F$2=1,B355,IF(Textes!F$2=2,C355,IF(Textes!F$2=3,D355,\"\")))","v":"JJ. MMM AAAA"},{"$f":"IF(IFERROR(VALUE(TEXT(Inv!DatumAnfang,\"JJJJ\")),0) >2000, \"TT.MM.JJJJ\",\"JJ. MMM AAAA\")","v":"JJ. MMM AAAA"},"TT. MMM. JJJJ"]
[{"$f":"IF(Textes!F$2=1,B356,IF(Textes!F$2=2,C356,IF(Textes!F$2=3,D356,\"\")))","v":"Année"},"Année","Jahr"]
[{"$f":"IF(Textes!F$2=1,B357,IF(Textes!F$2=2,C357,IF(Textes!F$2=3,D357,\"\")))","v":"Nombre d'animaux"},"Nombre d'animaux","Anzahl Tiere"]
[{"$f":"IF(Textes!F$2=1,B358,IF(Textes!F$2=2,C358,IF(Textes!F$2=3,D358,\"\")))","v":"UGB"},"UGB","GVE"]
[{"$f":"IF(Textes!F$2=1,B359,IF(Textes!F$2=2,C359,IF(Textes!F$2=3,D359,\"\")))","v":"Effectif moyen"},"Effectif moyen","Durchschnittsbestand"]
[{"$f":"IF(Textes!F$2=1,B360,IF(Textes!F$2=2,C360,IF(Textes!F$2=3,D360,\"\")))","v":"Poulailler 1"},"Poulailler 1","Stall 1"]
[{"$f":"IF(Textes!F$2=1,B361,IF(Textes!F$2=2,C361,IF(Textes!F$2=3,D361,\"\")))","v":"Poulailler 2"},"Poulailler 2","Stall 2"]
[{"$f":"IF(Textes!F$2=1,B362,IF(Textes!F$2=2,C362,IF(Textes!F$2=3,D362,\"\")))","v":"Poulailler 3"},"Poulailler 3","Stall 3"]
[{"$f":"IF(Textes!F$2=1,B363,IF(Textes!F$2=2,C363,IF(Textes!F$2=3,D363,\"\")))","v":"Feuilles"},"Feuilles","Tabellenblätter"]
[{"$f":"IF(Textes!F$2=1,B364,IF(Textes!F$2=2,C364,IF(Textes!F$2=3,D364,\"\")))","v":"choisir une feuille"},"choisir une feuille","Blatt wählen"]
[{"$f":"IF(Textes!F$2=1,B365,IF(Textes!F$2=2,C365,IF(Textes!F$2=3,D365,\"\")))","v":"imprimer les feuilles"},"imprimer les feuilles","Blätter drucken"]
[{"$f":"IF(Textes!F$2=1,B366,IF(Textes!F$2=2,C366,IF(Textes!F$2=3,D366,\"\")))","v":"sélectionner tout/rien"},"sélectionner tout/rien","Alles/Nichts markieren"]
[{"$f":"IF(Textes!F$2=1,B367,IF(Textes!F$2=2,C367,IF(Textes!F$2=3,D367,\"\")))","v":"imprimer la feuille de titre"},"imprimer la feuille de titre","Titelblatt drucken"]
[{"$f":"IF(Textes!F$2=1,B368,IF(Textes!F$2=2,C368,IF(Textes!F$2=3,D368,\"\")))","v":"imprimer"},"imprimer","Drucken"]
[{"$f":"IF(Textes!F$2=1,B369,IF(Textes!F$2=2,C369,IF(Textes!F$2=3,D369,\"\")))","v":"annuler"},"annuler","Abbrechen"]
[{"$f":"IF(Textes!F$2=1,B370,IF(Textes!F$2=2,C370,IF(Textes!F$2=3,D370,\"\")))","v":"Table des matières"},"Table des matières","Inhaltsverzeichnis"]
[{"$f":"IF(Textes!F$2=1,B371,IF(Textes!F$2=2,C371,IF(Textes!F$2=3,D371,\"\")))","v":"No cantonal:"},"No cantonal:","Betriebs-Nr:"]
[{"$f":"IF(Textes!F$2=1,B372,IF(Textes!F$2=2,C372,IF(Textes!F$2=3,D372,\"\")))","v":"Exploitation:"},"Exploitation:","Betrieb:"]
[{"$f":"IF(Textes!F$2=1,B373,IF(Textes!F$2=2,C373,IF(Textes!F$2=3,D373,\"\")))","v":"Adresse:"},"Adresse:","Adresse:"]
[{"$f":"IF(Textes!F$2=1,B374,IF(Textes!F$2=2,C374,IF(Textes!F$2=3,D374,\"\")))","v":"NPA, lieu:"},"NPA, lieu:","PLZ, Ort:"]
[{"$f":"IF(Textes!F$2=1,B375,IF(Textes!F$2=2,C375,IF(Textes!F$2=3,D375,\"\")))","v":"Calculé par:"},"Calculé par:","Berechnet durch:"]
[{"$f":"IF(Textes!F$2=1,B376,IF(Textes!F$2=2,C376,IF(Textes!F$2=3,D376,\"\")))","v":"Firme:"},"Firme:","Firma:"]
[{"$f":"IF(Textes!F$2=1,B377,IF(Textes!F$2=2,C377,IF(Textes!F$2=3,D377,\"\")))","v":"No téléphone:"},"No téléphone:","Telefon-Nr:"]
[{"$f":"IF(Textes!F$2=1,B378,IF(Textes!F$2=2,C378,IF(Textes!F$2=3,D378,\"\")))","v":"Période:"},"Période:","Periode:"]
[{"$f":"IF(Textes!F$2=1,B379,IF(Textes!F$2=2,C379,IF(Textes!F$2=3,D379,\"\")))","v":"Mode d'emploi"},"Mode d'emploi","Bedienungsanleitung"]
[{"$f":"IF(Textes!F$2=1,B380,IF(Textes!F$2=2,C380,IF(Textes!F$2=3,D380,\"\")))","v":"Version"},"Version","Version"]
[{"$f":"IF(Textes!F$2=1,B381,IF(Textes!F$2=2,C381,IF(Textes!F$2=3,D381,\"\")))","v":"Table des matières"},"Table des matières","Inhaltsverzeichnis:"]
[{"$f":"IF(Textes!F$2=1,B382,IF(Textes!F$2=2,C382,IF(Textes!F$2=3,D382,\"\")))","v":"1 Indications générales concernant l‘utilisation"},"1 Indications générales concernant l‘utilisation","1 Allgemeine Hinweise zur Bedienung"]
[{"$f":"IF(Textes!F$2=1,B383,IF(Textes!F$2=2,C383,IF(Textes!F$2=3,D383,\"\")))","v":"2 Notes concernant le remplissage des tableaux"},"2 Notes concernant le remplissage des tableaux","2 Hinweise zum Ausfüllen der Tabellenblätter"]
[{"$f":"IF(Textes!F$2=1,B384,IF(Textes!F$2=2,C384,IF(Textes!F$2=3,D384,\"\")))","v":"2a) Instructions pour les porcs, poulettes, dindes à l’engrais et lapins"},"2a) Instructions pour les porcs, poulettes, dindes à l’engrais et lapins","2a) Anleitung für Schweine, Junghennen, Masttruten und Kaninchen"]
[{"$f":"IF(Textes!F$2=1,B385,IF(Textes!F$2=2,C385,IF(Textes!F$2=3,D385,\"\")))","v":"2b) Instructions pour les exploitations ayant des poulets à l‘engrais"},"2b) Instructions pour les exploitations ayant des poulets à l‘engrais","2b) Anleitung für Mastpouletsbetriebe"]
[{"$f":"IF(Textes!F$2=1,B386,IF(Textes!F$2=2,C386,IF(Textes!F$2=3,D386,\"\")))","v":"2c) Indications supplémentaires pour des exploitations ayant des poulets à l‘engrais extensif"},"2c) Indications supplémentaires pour des exploitations ayant des poulets à l‘engrais extensif","2c) Zusätzliche Hinweise für extensive Pouletmastbetriebe"]
[{"$f":"IF(Textes!F$2=1,B387,IF(Textes!F$2=2,C387,IF(Textes!F$2=3,D387,\"\")))","v":"1 Indications générales concernant l‘utilisation"},"1 Indications générales concernant l‘utilisation","1 Allgemeine Hinweise zur Bedienung"]
[{"$f":"IF(Textes!F$2=1,B388,IF(Textes!F$2=2,C388,IF(Textes!F$2=3,D388,\"\")))","v":"Macros:"},"Macros:","Makros: "]
[{"$f":"IF(Textes!F$2=1,B389,IF(Textes!F$2=2,C389,IF(Textes!F$2=3,D389,\"\")))","v":"Les macros doivent être autorisées."},"Les macros doivent être autorisées.","Makros müssen zugelassen sein."]
[{"$f":"IF(Textes!F$2=1,B390,IF(Textes!F$2=2,C390,IF(Textes!F$2=3,D390,\"\")))","v":"Si « poulets à l’engrais » apparaît automatiquement dans le tableau"},"Si « poulets à l’engrais » apparaît automatiquement dans le tableau","Sie erkennen, dass die Makros zugelassen sind, wenn Sie bei der Auswahl der Tierart"]
[{"$f":"IF(Textes!F$2=1,B391,IF(Textes!F$2=2,C391,IF(Textes!F$2=3,D391,\"\")))","v":"Poulet1 lors du choix de l’espèce, les macros sont autorisées"},"Poulet1 lors du choix de l’espèce, les macros sont autorisées","z.B. „Mastpoulets“ wählen und damit automatisch auf das Tabellenblatt Poulet1 springen."]
[{"$f":"IF(Textes!F$2=1,B392,IF(Textes!F$2=2,C392,IF(Textes!F$2=3,D392,\"\")))","v":"=> Instructions en détail"},"=> Instructions en détail","=> ausführliche Anleitung:"]
[{"$f":"IF(Textes!F$2=1,B393,IF(Textes!F$2=2,C393,IF(Textes!F$2=3,D393,\"\")))","v":"www.agridea.ch > Software > Downloads > Impex 2.12 > Instructions"},{"$f":"\"www.agridea.ch > Software > Downloads > Impex \" & Q!VersionsNummer & \" > Instructions\"","v":"www.agridea.ch > Software > Downloads > Impex 2.12 > Instructions"},{"$f":"\" www.agridea.ch > Software > Downloads > Impex \" & Q!VersionsNummer & \" > Anleitung\"","v":" www.agridea.ch > Software > Downloads > Impex 2.12 > Anleitung"}]
[{"$f":"IF(Textes!F$2=1,B394,IF(Textes!F$2=2,C394,IF(Textes!F$2=3,D394,\"\")))","v":"Saisie des données"},"Saisie des données","Datenerfassung: "]
[{"$f":"IF(Textes!F$2=1,B395,IF(Textes!F$2=2,C395,IF(Textes!F$2=3,D395,\"\")))","v":"Cellules jaunes"},"Cellules jaunes","Gelbe Zellen"]
[{"$f":"IF(Textes!F$2=1,B396,IF(Textes!F$2=2,C396,IF(Textes!F$2=3,D396,\"\")))","v":"Selon les besoins, vous pouvez ici saisir du texte ou des chiffres"},"Selon les besoins, vous pouvez ici saisir du texte ou des chiffres","Hier können Sie je nach Bedarf Text oder Zahlen eingeben"]
[{"$f":"IF(Textes!F$2=1,B397,IF(Textes!F$2=2,C397,IF(Textes!F$2=3,D397,\"\")))","v":"Cellules blanches"},"Cellules blanches","Weisse Zellen"]
[{"$f":"IF(Textes!F$2=1,B398,IF(Textes!F$2=2,C398,IF(Textes!F$2=3,D398,\"\")))","v":"Ces cellules sont généralement bloquées à la saisie"},"Ces cellules sont généralement bloquées à la saisie","sind grundsätzlich für die Erfassung gesperrt"]
[{"$f":"IF(Textes!F$2=1,B399,IF(Textes!F$2=2,C399,IF(Textes!F$2=3,D399,\"\")))","v":"Imprimer:"},"Imprimer:","Drucken:"]
[{"$f":"IF(Textes!F$2=1,B400,IF(Textes!F$2=2,C400,IF(Textes!F$2=3,D400,\"\")))","v":"Excel 2007, 2010, 2013 ainsi que 2016: Choisissez le menu"},"Excel 2007, 2010, 2013 ainsi que 2016: Choisissez le menu","- Excel 2007, 2010, 2013 bzw. 2016: Wählen Sie das Menu \"Add-Ins\""]
[{"$f":"IF(Textes!F$2=1,B401,IF(Textes!F$2=2,C401,IF(Textes!F$2=3,D401,\"\")))","v":"« Compléments » et le sous-menu « Feuilles »"},"« Compléments » et le sous-menu « Feuilles »","  und das Untermenu \"Tabellenblätter\""]
[{"$f":"IF(Textes!F$2=1,B402,IF(Textes!F$2=2,C402,IF(Textes!F$2=3,D402,\"\")))","v":"Excel 2003: Choisissiez le menu «Feuilles »"},"Excel 2003: Choisissiez le menu «Feuilles »","- Excel 2003: Wählen Sie das Menu \"Tabellenblätter\""]
[{"$f":"IF(Textes!F$2=1,B403,IF(Textes!F$2=2,C403,IF(Textes!F$2=3,D403,\"\")))","v":"Lorsque vous choisissez le sous-menu « Imprimer », une liste de sélection apparait"},"Lorsque vous choisissez le sous-menu « Imprimer », une liste de sélection apparait","Beim Aufruf des Untermenus \"drucken\" erscheint eine Auswahlliste, aus welcher"]
[{"$f":"IF(Textes!F$2=1,B404,IF(Textes!F$2=2,C404,IF(Textes!F$2=3,D404,\"\")))","v":"dans laquelle une ou plusieurs feuilles de calcul peuvent être sélectionnées"},"dans laquelle une ou plusieurs feuilles de calcul peuvent être sélectionnées","durch Anklicken einzelne oder mehrere Tabellenblätter für den Druck markiert"]
[{"$f":"IF(Textes!F$2=1,B405,IF(Textes!F$2=2,C405,IF(Textes!F$2=3,D405,\"\")))","v":"par simple clic pour l'impression. Pour une sélection multiple, pressez Ctrl pendant le processus de sélection."},"par simple clic pour l'impression. Pour une sélection multiple, pressez Ctrl pendant le processus de sélection.","werden können. Für die Mehrfachmarkierung halten Sie während des Vorganges"]
[{"$f":"IF(Textes!F$2=1,B406,IF(Textes!F$2=2,C406,IF(Textes!F$2=3,D406,\"\")))","v":"En appuyant sur ce bouton toutes les feuilles seront sélectionnées."},"En appuyant sur ce bouton toutes les feuilles seront sélectionnées.","die Ctrl - Taste gedrückt. Das Betätigen der oberen Schaltfläche markiert alle Blätter."]
[{"$f":"IF(Textes!F$2=1,B407,IF(Textes!F$2=2,C407,IF(Textes!F$2=3,D407,\"\")))","v":"Enregistrement du fichier:"},"Enregistrement du fichier:","Speichern der Datei: "]
[{"$f":"IF(Textes!F$2=1,B408,IF(Textes!F$2=2,C408,IF(Textes!F$2=3,D408,\"\")))","v":"Attention : avec Excel 2007, 2010, 2013 ainsi que 2016: Sous « enregistrer sous »"},"Attention : avec Excel 2007, 2010, 2013 ainsi que 2016: Sous « enregistrer sous »","Achtung: Bei Excel 2007, 2010, 2013 bzw. 2016 müssen Sie beim „Speichern unter“ "]
[{"$f":"IF(Textes!F$2=1,B409,IF(Textes!F$2=2,C409,IF(Textes!F$2=3,D409,\"\")))","v":"vous devez choisir le type « fichier Excel avec macros » (.xlsm). "},"vous devez choisir le type « fichier Excel avec macros » (.xlsm). ","den Dateityp „Excel-Arbeitsmappe mit Makros“ (.xlsm) angeben."]
[{"$f":"IF(Textes!F$2=1,B410,IF(Textes!F$2=2,C410,IF(Textes!F$2=3,D410,\"\")))","v":"2 Notes concernant le remplissage des tableaux"},"2 Notes concernant le remplissage des tableaux","2 Hinweise zum Ausfüllen der Tabellenblätter"]
[{"$f":"IF(Textes!F$2=1,B411,IF(Textes!F$2=2,C411,IF(Textes!F$2=3,D411,\"\")))","v":"Tenez tous les documents (listing des aliments, poids abattus…) à portée de main."},"Tenez tous les documents (listing des aliments, poids abattus…) à portée de main.","Halten Sie alle Unterlagen griffbereit (Auszüge Futtermittel, Schlachtgewichte, …)"]
[{"$f":"IF(Textes!F$2=1,B412,IF(Textes!F$2=2,C412,IF(Textes!F$2=3,D412,\"\")))","v":"Les virgules ne sont pas acceptées! Toutes les virgules et dates doivent être saisies avec des points (« . »)."},"Les virgules ne sont pas acceptées! Toutes les virgules et dates doivent être saisies avec des points (« . »).","Keine Kommas! Alle Kommastellen und Daten sind mit einem Punkt (\".\") einzugeben."]
[{"$f":"IF(Textes!F$2=1,B413,IF(Textes!F$2=2,C413,IF(Textes!F$2=3,D413,\"\")))","v":"2a) Instructions concernant les porcs, poulettes, dindes et lapins"},"2a) Instructions concernant les porcs, poulettes, dindes et lapins","2a) Anleitung für Schweine, Junghennen, Masttruten und Kaninchen"]
[{"$f":"IF(Textes!F$2=1,B414,IF(Textes!F$2=2,C414,IF(Textes!F$2=3,D414,\"\")))","v":"1. Start au tableau Inv [=Inventaire]:"},"1. Start au tableau Inv [=Inventaire]:","1. Start bei Tabellenblatt Inv [=Inventar]:"]
[{"$f":"IF(Textes!F$2=1,B415,IF(Textes!F$2=2,C415,IF(Textes!F$2=3,D415,\"\")))","v":"Choisissez la langue, saisissez votre adresse, la période et la catégorie d’animaux"},"Choisissez la langue, saisissez votre adresse, la période et la catégorie d’animaux"," Wählen Sie die Sprache, erfassen Sie Ihre Adresse, die Periode und Tierart"]
[{"$f":"IF(Textes!F$2=1,B416,IF(Textes!F$2=2,C416,IF(Textes!F$2=3,D416,\"\")))","v":"2. Saisie des données sur les fiches suivantes (poulets à l’engrais => voir point 2b)"},"2. Saisie des données sur les fiches suivantes (poulets à l’engrais => voir point 2b)","2. Datenerfassung auf folgenden Datenblättern (Mastpoulet => siehe Punkt 2b):"]
[{"$f":"IF(Textes!F$2=1,B417,IF(Textes!F$2=2,C417,IF(Textes!F$2=3,D417,\"\")))","v":"- De plus, sur  la fiche Inv: Inventaire des aliments et animaux"},"- De plus, sur  la fiche Inv: Inventaire des aliments et animaux","- zusätzlich auf dem Tabellenblatt Inv: Inventar der Futtermittel und Tiere"]
[{"$f":"IF(Textes!F$2=1,B418,IF(Textes!F$2=2,C418,IF(Textes!F$2=3,D418,\"\")))","v":"  Attention: Les saisies des teneurs des aliments doivent toujours être faites en g par kg !"},"  Attention: Les saisies des teneurs des aliments doivent toujours être faites en g par kg !","   Achtung: Futtergehalte immer in g pro kg erfassen!"]
[{"$f":"IF(Textes!F$2=1,B419,IF(Textes!F$2=2,C419,IF(Textes!F$2=3,D419,\"\")))","v":"- Fiche A1a-e: Toutes les entrées des animaux"},"- Fiche A1a-e: Toutes les entrées des animaux","- Tabellenblätter A1a-e: Alle Tierzugänge"]
[{"$f":"IF(Textes!F$2=1,B420,IF(Textes!F$2=2,C420,IF(Textes!F$2=3,D420,\"\")))","v":"- Fiche A2a-e: Toutes les sorties des animaux"},"- Fiche A2a-e: Toutes les sorties des animaux","- Tabellenblätter A2a-e: alle Tierausgänge"]
[{"$f":"IF(Textes!F$2=1,B421,IF(Textes!F$2=2,C421,IF(Textes!F$2=3,D421,\"\")))","v":"  Porcs: Répartition des catégories d’animaux sur les différentes fiches"},"  Porcs: Répartition des catégories d’animaux sur les différentes fiches","   Bei Schweinen: Aufteilung der Tierkategorien auf verschiedene Tabellenblätter"]
[{"$f":"IF(Textes!F$2=1,B422,IF(Textes!F$2=2,C422,IF(Textes!F$2=3,D422,\"\")))","v":"  et choix du rendement d’abattage concerné. Par exemple :"},"  et choix du rendement d’abattage concerné. Par exemple :","   und Wahl der richtigen Schlachtausbeute. Bsp: Auf A2a Mastschweine erfassen,"]
[{"$f":"IF(Textes!F$2=1,B423,IF(Textes!F$2=2,C423,IF(Textes!F$2=3,D423,\"\")))","v":"  A2a saisie des porcs à l’engrais, A2b truies mères échaudées, A2c truies mères dépouillées, etc."},"  A2a saisie des porcs à l’engrais, A2b truies mères échaudées, A2c truies mères dépouillées, etc.","   auf A2b Muttersauen gebrüht, auf A2c Muttersauen gehäutet, etc."]
[{"$f":"IF(Textes!F$2=1,B424,IF(Textes!F$2=2,C424,IF(Textes!F$2=3,D424,\"\")))","v":"- Page B1-5: Tous les aliments"},"- Page B1-5: Tous les aliments","- Tabellenblätter B1-5: alle Futtermittel"]
[{"$f":"IF(Textes!F$2=1,B425,IF(Textes!F$2=2,C425,IF(Textes!F$2=3,D425,\"\")))","v":"- Fiche Impex: Aperçu/résultats. Le bilan des animaux doit être égal à zéro."},"- Fiche Impex: Aperçu/résultats. Le bilan des animaux doit être égal à zéro.","- Tabellenblatt Impex: zeigt die Resultate. Tierbilanz bei Mastschweinen muss Null sein."]
[{"$f":"IF(Textes!F$2=1,B426,IF(Textes!F$2=2,C426,IF(Textes!F$2=3,D426,\"\")))","v":"- Fiche Plausi: Saisie de l’effectif moyen et transfert de la production"},"- Fiche Plausi: Saisie de l’effectif moyen et transfert de la production","- Tabellenblatt Plausi: Durchschnittsbestand eintragen und massgebenden Nährstoffanfall  "]
[{"$f":"IF(Textes!F$2=1,B427,IF(Textes!F$2=2,C427,IF(Textes!F$2=3,D427,\"\")))","v":"  des éléments nutritifs dans le Suisse-Bilanz"},"  des éléments nutritifs dans le Suisse-Bilanz","   auf Suisse-Bilanz übertragen"]
[{"$f":"IF(Textes!F$2=1,B428,IF(Textes!F$2=2,C428,IF(Textes!F$2=3,D428,\"\")))","v":"2b) Instructions pour les exploitations ayant des poulets à l‘engrais"},"2b) Instructions pour les exploitations ayant des poulets à l‘engrais","2b) Anleitung für Mastpouletbetriebe"]
[{"$f":"IF(Textes!F$2=1,B429,IF(Textes!F$2=2,C429,IF(Textes!F$2=3,D429,\"\")))","v":"1. Start à la fiche Inv [Inventaire]:"},"1. Start à la fiche Inv [Inventaire]:","1. Start bei Tabellenblatt Inv [Inventar]: "]
[{"$f":"IF(Textes!F$2=1,B430,IF(Textes!F$2=2,C430,IF(Textes!F$2=3,D430,\"\")))","v":"Choix de la langue, saisie de l’adresse et de la période."},"Choix de la langue, saisie de l’adresse et de la période.","Wahl der Sprache, Erfassen von Adresse und Periode."]
[{"$f":"IF(Textes!F$2=1,B431,IF(Textes!F$2=2,C431,IF(Textes!F$2=3,D431,\"\")))","v":"L’inventaire des animaux ne doit PAS être saisi."},"L’inventaire des animaux ne doit PAS être saisi.","Das Tierinventar ist NICHT zu erfassen."]
[{"$f":"IF(Textes!F$2=1,B432,IF(Textes!F$2=2,C432,IF(Textes!F$2=3,D432,\"\")))","v":"Choix de la catégorie « poulets à l’engrais » => transfert automatiquement vers Poulet1"},"Choix de la catégorie « poulets à l’engrais » => transfert automatiquement vers Poulet1","Auswahl der Tierart Mastpoulets => automatisches Springen auf Tabellenblatt Poulet1"]
[{"$f":"IF(Textes!F$2=1,B433,IF(Textes!F$2=2,C433,IF(Textes!F$2=3,D433,\"\")))","v":"2. Fiches Poulet1, Poulet2, …:"},"2. Fiches Poulet1, Poulet2, …:","2. Tabellenblatt Poulet1, Poulet2, …:"]
[{"$f":"IF(Textes!F$2=1,B434,IF(Textes!F$2=2,C434,IF(Textes!F$2=3,D434,\"\")))","v":"Saisissiez les dates et nombres de toutes les rotations."},"Saisissiez les dates et nombres de toutes les rotations.","Erfassen Sie Daten und Stückzahlen aller Umtriebe."]
[{"$f":"IF(Textes!F$2=1,B435,IF(Textes!F$2=2,C435,IF(Textes!F$2=3,D435,\"\")))","v":"Attention : les rotations qui ont commencé avant la période"},"Attention : les rotations qui ont commencé avant la période","Achtung: In der vergangenen Periode angefangene Umtriebe bzw. solche, die erst"]
[{"$f":"IF(Textes!F$2=1,B436,IF(Textes!F$2=2,C436,IF(Textes!F$2=3,D436,\"\")))","v":"ou qui finissent après la période doivent être saisies entièrement."},"ou qui finissent après la période doivent être saisies entièrement.","in der folgenden Periode abgeschlossen sein werden, sind GANZ zu erfassen. "]
[{"$f":"IF(Textes!F$2=1,B437,IF(Textes!F$2=2,C437,IF(Textes!F$2=3,D437,\"\")))","v":"La délimitation de l’année s’effectue automatiquement."},"La délimitation de l’année s’effectue automatiquement.","Das Programm berechnet die Abgrenzung automatisch. "]
[{"$f":"IF(Textes!F$2=1,B438,IF(Textes!F$2=2,C438,IF(Textes!F$2=3,D438,\"\")))","v":"Si l’effectif moyen calculé est supérieur à 3‘000 poulets,"},"Si l’effectif moyen calculé est supérieur à 3‘000 poulets,","Ist der ausgewiesene Durchschnittsbestand > 3'000 Stück muss auch das Lebendgewicht"]
[{"$f":"IF(Textes!F$2=1,B439,IF(Textes!F$2=2,C439,IF(Textes!F$2=3,D439,\"\")))","v":"le poids vivant doit aussi être saisi ainsi qu’un bilan import/export complet calculé."},"le poids vivant doit aussi être saisi ainsi qu’un bilan import/export complet calculé.","erfasst werden und eine vollständige Import/Exportbilanz ausgefüllt werden."]
[{"$f":"IF(Textes!F$2=1,B440,IF(Textes!F$2=2,C440,IF(Textes!F$2=3,D440,\"\")))","v":"Si l’effectif moyen calculé est inférieur à 3‘000 poulets,"},"Si l’effectif moyen calculé est inférieur à 3‘000 poulets,","Ist der errechnete Durchschnittsbestand < 3'000 Stück, so muss"]
[{"$f":"IF(Textes!F$2=1,B441,IF(Textes!F$2=2,C441,IF(Textes!F$2=3,D441,\"\")))","v":"le poids vivant ne doit pas être saisi."},"le poids vivant ne doit pas être saisi.","das Lebendgewicht nicht erfasst werden."]
[{"$f":"IF(Textes!F$2=1,B442,IF(Textes!F$2=2,C442,IF(Textes!F$2=3,D442,\"\")))","v":"3. Bouton de commande «Achat et"},"3. Bouton de commande «Achat et","3. Schaltfläche „Zu- und Verkäufe "]
[{"$f":"IF(Textes!F$2=1,B443,IF(Textes!F$2=2,C443,IF(Textes!F$2=3,D443,\"\")))","v":"    vente transférés dans A1c et A2c»:"},"    vente transférés dans A1c et A2c»:","    nach A1a und A2a übertragen“ "]
[{"$f":"IF(Textes!F$2=1,B444,IF(Textes!F$2=2,C444,IF(Textes!F$2=3,D444,\"\")))","v":"transfert de toutes le entrées et sorties d’animaux dans les fiches A1a-c et A2a-c."},"transfert de toutes le entrées et sorties d’animaux dans les fiches A1a-c et A2a-c.","Überträgt alle Tierzu- und Weggänge in die Blätter A1a-c und A2a-c."]
[{"$f":"IF(Textes!F$2=1,B445,IF(Textes!F$2=2,C445,IF(Textes!F$2=3,D445,\"\")))","v":"Attention : il faut d’abord saisir toutes les rotations."},"Attention : il faut d’abord saisir toutes les rotations.","Achtung: Zuerst alle Umtriebe erfassen."]
[{"$f":"IF(Textes!F$2=1,B446,IF(Textes!F$2=2,C446,IF(Textes!F$2=3,D446,\"\")))","v":"4. Fiche Inv:"},"4. Fiche Inv:","4. Tabellenblatt Inv:"]
[{"$f":"IF(Textes!F$2=1,B447,IF(Textes!F$2=2,C447,IF(Textes!F$2=3,D447,\"\")))","v":"Saisissez les teneurs des aliments et les inventaires début/fin"},"Saisissez les teneurs des aliments et les inventaires début/fin","Sie erfassen die Gehalte der Futtermittel, die Anfangs- und Endbestände."]
[{"$f":"IF(Textes!F$2=1,B448,IF(Textes!F$2=2,C448,IF(Textes!F$2=3,D448,\"\")))","v":"Attention : les teneurs des aliments doivent être saisies en g! Exemple : 21% MA= 210 g MA par kg aliment"},"Attention : les teneurs des aliments doivent être saisies en g! Exemple : 21% MA= 210 g MA par kg aliment","Achtung: Futtermittelgehalte in Gramm erfassen. Bsp.: 21% RP = 210 g RP pro kg Futter"]
[{"$f":"IF(Textes!F$2=1,B449,IF(Textes!F$2=2,C449,IF(Textes!F$2=3,D449,\"\")))","v":"5. Fiche B1-B4"},"5. Fiche B1-B4","5. Tabellenblatt B1-B4:"]
[{"$f":"IF(Textes!F$2=1,B450,IF(Textes!F$2=2,C450,IF(Textes!F$2=3,D450,\"\")))","v":"Saisissez la quantité des aliments achetés."},"Saisissez la quantité des aliments achetés.","Sie erfassen die Mengen der zugekauften Futtermittel."]
[{"$f":"IF(Textes!F$2=1,B451,IF(Textes!F$2=2,C451,IF(Textes!F$2=3,D451,\"\")))","v":"Comparer le total des aliments livrés dans cette année et le listing du fournisseur d’aliments."},"Comparer le total des aliments livrés dans cette année et le listing du fournisseur d’aliments.","Abgleich der Jahresliefermenge mit Auszügen der Futtermühle."]
[{"$f":"IF(Textes!F$2=1,B452,IF(Textes!F$2=2,C452,IF(Textes!F$2=3,D452,\"\")))","v":"6. Fiche Poulet_tot :"},"6. Fiche Poulet_tot :","6. Tabellenblatt Poulet_tot:"]
[{"$f":"IF(Textes!F$2=1,B453,IF(Textes!F$2=2,C453,IF(Textes!F$2=3,D453,\"\")))","v":"Résultats concernant l’effectif moyen"},"Résultats concernant l’effectif moyen","Resultate zum Durchschnittsbestand"]
[{"$f":"IF(Textes!F$2=1,B454,IF(Textes!F$2=2,C454,IF(Textes!F$2=3,D454,\"\")))","v":"7. Fiche Impex :"},"7. Fiche Impex :","7. Tabellenblatt Impex:"]
[{"$f":"IF(Textes!F$2=1,B455,IF(Textes!F$2=2,C455,IF(Textes!F$2=3,D455,\"\")))","v":"Résultat concernant le bilan import/export"},"Résultat concernant le bilan import/export","Resultate für die Import-Export-Bilanz. "]
[{"$f":"IF(Textes!F$2=1,B456,IF(Textes!F$2=2,C456,IF(Textes!F$2=3,D456,\"\")))","v":"Contrôle : Le bilan des animaux doit être égal à zéro, "},"Contrôle : Le bilan des animaux doit être égal à zéro, ","Achtung zur Kontrolle: Tierbilanz muss Null sein, Futterverwertung soll plausibel sein."]
[{"$f":"IF(Textes!F$2=1,B457,IF(Textes!F$2=2,C457,IF(Textes!F$2=3,D457,\"\")))","v":"8. Fiche Plausi :"},"8. Fiche Plausi :","8. Tabellenblatt Plausi:"]
[{"$f":"IF(Textes!F$2=1,B458,IF(Textes!F$2=2,C458,IF(Textes!F$2=3,D458,\"\")))","v":"Production des éléments nutritifs effectifs à reporter dans le Suisse-Bilanz"},"Production des éléments nutritifs effectifs à reporter dans le Suisse-Bilanz","Massgebenden Nährstoffanfall auf Suisse-Bilanz übertragen."]
[{"$f":"IF(Textes!F$2=1,B459,IF(Textes!F$2=2,C459,IF(Textes!F$2=3,D459,\"\")))","v":"2c) Indications supplémentaires pour des exploitations ayant des poulets à l’engrais extensif (Bio)"},"2c) Indications supplémentaires pour des exploitations ayant des poulets à l’engrais extensif (Bio)","2c) Zusätzliche Hinweise für extensive Pouletmäster (Bio)"]
[{"$f":"IF(Textes!F$2=1,B460,IF(Textes!F$2=2,C460,IF(Textes!F$2=3,D460,\"\")))","v":"Exploitation ayant des poulaillers de "},"Exploitation ayant des poulaillers de ","Betriebe mit Vor- und Ausmaststall: "]
[{"$f":"IF(Textes!F$2=1,B461,IF(Textes!F$2=2,C461,IF(Textes!F$2=3,D461,\"\")))","v":"pré-engraissement et d’engraissement"},"pré-engraissement et d’engraissement"," "]
[{"$f":"IF(Textes!F$2=1,B462,IF(Textes!F$2=2,C462,IF(Textes!F$2=3,D462,\"\")))","v":"Saisir les rotations en alternand dans les fiches Poulet1 et Poulet2"},"Saisir les rotations en alternand dans les fiches Poulet1 et Poulet2","Erfassen die Umtriebe alternierend auf Tabellenblatt Poulet1 und Poulet 2. "]
[{"$f":"IF(Textes!F$2=1,B463,IF(Textes!F$2=2,C463,IF(Textes!F$2=3,D463,\"\")))","v":"Exemple: Rotations 1, 3, 5 => Fiche Poulet1; Rotations 2, 4, 6 => Fiche Poulet2"},"Exemple: Rotations 1, 3, 5 => Fiche Poulet1; Rotations 2, 4, 6 => Fiche Poulet2","Beispiel: Umtriebe 1, 3, 5 => Tabellenblatt Poulet 1; Umtriebe 2, 4, 6 => Tabellenblatt Poulet2"]
[{"$f":"IF(Textes!F$2=1,B464,IF(Textes!F$2=2,C464,IF(Textes!F$2=3,D464,\"\")))","v":"Changer au tableur « Inv »"},"Changer au tableur « Inv »","Zum Tabellenblatt \"Inv\" wechseln"]
[{"$f":"IF(Textes!F$2=1,B465,IF(Textes!F$2=2,C465,IF(Textes!F$2=3,D465,\"\")))","v":"Rendement d'abattage"},"Rendement d'abattage","Schlachtausbeute:"]

{"sheet":"Corr","index":35,"n_rows":47,"n_cols":5,"rows_kept":47,"cut":false,"hidden":true,"merged":[]}
["Datum","Blatt","Version","Anpassungen","Grund"]
["2004-05-25","Impex",null,"Neue Berechnung des MJ Verbrauch in 365 Tage (Kontrolldaten)","GT 19.5.2004"]
["2004-05-25","Impex",null,"Futter 88% TS/365 Tage. Beim ersten Teil des futtermittel wurde bisher immer mit 88% TS gerechnet auch wenn das Futter einen anderen TS Gehalt aufwies. Zellen R20-31","GT 19.5.2004"]
["2004-06-02","Inventar",null,"Anpassungen der Werte des gelben Buchs: \nSchotte  137 RP, 7.3 P; \nMaïs ganze Pflanze 100 %TS, 11 MJ, 74 RP, 2 P.","Anpassungen ALP"]
["2004-07-12","Inventar",null,"Formel C21 und F21 mit \"0\" statt \"\" => keine Fehlermeldung in Impex I58","A. Uebersax"]
["2004-07-12","Impex",null,"K51, K53 und K54 kein Wert wenn Junghennen","A. Uebersax"]
["2004-08-19","A2",null,"Formel in J45 und J46 fehlte","A. Uebersax"]
["2004-09-28","Impex",null,"Unvermeidbare Verluste der Junghennen (U6+C35 neu = 0.6)","GT 19.5.2004"]
["2007-08-20","Impex",null,"Zusätzliche Tabellenblätter für Tierein- und -ausgänge; Möglichkeit, in Listenblättern Zeilen einzufügen","Wunsch von Anwendern mit grossen Tierbeständen"]
["2008-03-11","Impex",null,"Neuaufnahme der Tierkategorien Mastpoulets und Kaninchen","GT 12.03.08"]
["2008-04-03","Impex und Linear",null,"Angepasste Gehaltswerte für Schotte, CCM, Mais ganze Pflanze u. Wiesenfutter  aufgrund Futtermitteldatenbank ALP","GT 12.03.08"]
["2009-01-07","Impex",null,"Angepasste Gehaltswerte für Schotte, CCM, Mais ganze Pflanze u. Wiesenfutter  aufgrund Futtermitteldatenbank ALP","GT Dez.08"]
["2010-06-15","Impex",null,"Angepasste Gehaltswerte für Wiesenfutter, angepasste Tiefstwerte für Tierkategorien, neue Tierkategorie Masttruten","GT Nov. 09, GRUDAF 09"]
["2010-08-30","Impex",null,"2 neue Zeilen in Tierbilanz für Umrechnung von Zukauf und Ausgang auf 365 Tage"]
["2010-08-30",null,null,"Einbindung der 5 Blätter des BLW-Poulet-Tools zur Berechnung des durchschnittlichen Bestandes mit Übertrag der Tierzahlen und -gewichte in die Impexblätter"]
["2010-11-08",null,null,"In Pouletblättern fixe Kükengewichte (40g) und überschreibbare Vorgabewert für Abgänge (600g)"]
["2010-11-08","Impex",null,"Fehler bei N-Ges-Anteil für Truten: 0.6 statt 0.85 (Zelle U4); Formelfehler in Zelle E1 (Tierkatagorie)","Beim Einbau von Masttruten übersehen"]
["2011-01-12","Impex",null,"Neue Ganzkörperwerte für Mastpoulets","Totkörperanalyse ALP"]
["2011-09-28","Impex",null,"Überarbeitung der Pouletblätter und der Übertragsmechanismen, Anpassungen an Wegleitung 1.9","BLW, GT 10.05.2011"]
["2011-10-10","Impex",null,"Neue Ganzkörperwerte für Masttruten, neue Tiefstwerte für Kaninchen (neue Kategorien)","H.Menzi / P.Schlegel"]
["2011-12-16","Impex",null,"Plausibilisierung der Datumseingaben in den Blättern \"Inv\" und \"Poulet1\" bis \"Poulet4\" mit entsprechenden Hinweisen","Laufzeitfehler bei unsinnigen Eingaben"]
["2012-01-10","Impex",null,"Plausibilisierung des Anfangs- und Enddatums der Periode (nur bei Poulets) im Blatt \"Inv\"","Unsinnige Resultate bei falschen Eingaben"]
["2012-01-26","Impex",null,"Fehlerkorrektur im Blatt \"Impex\": fehlende Formeln in den Zellen P31 bis R34"]
["2012-04-10","Impex","2.3a","Poulet-Blätter: Beheben einer Ungenauigkeit bei der Übertragung der Inventarwerte"]
["2012-08-31","Impex",2.4," - Neue Tiefstwerte bei Junghennen und Mastpoulets","GT "]
[null,null,null," - Auswahl der Schlachtart bei Schweinen (Ausbeute)"]
[null,null,null," - Fehlerkorrektur bei Seitenzahlen auf Poulet-Blättern"]
[null,null,null," - Einbau eines Menüs \"Tabellenblätter\" mit den Untermenüs \"Blatt wählen\" und \"drucken\", fakultatives Inhaltsverzeichnis"]
[null,null,null," - Neues Blatt mit Hinweisen zur Bedienung des Programmes als Startseite"]
["Ab hier IWE Juli 2013"]
["2013-07-09","Impex",2.5,"Definitionen Blatt Plausi ergänzen","GT 2013"]
["2014-02-07","Impex","2.5a","Anfangsinventarwert korrigieren, wenn letzter Umtrieb am 31.12. eingestallt wird. Grund: mit bisheriger Formel war Endinventar vom alten Jahr<>Anfangsinventar vom neuen Jahr, weil der Einstallungstag nie als Tag für Wachstum zählt. Die Kücken sind 1 Tag alt, erst am Tag nach der Einstallung und haben dann 40 g. Stallt man am 31. ein, so waren sie bisher 0 Tage alt, mit 0 g Gewicht. Formel ergänzt in M17, so dass, wenn N17=0, dann sind sie trotzdem 1 Tag alt.","Th. Schildknecht"]
["2015-02-24","Impex","2.5b","DFE: Die Futtermittelliste soll erweitert werden können, um mehr Futtermittel zu erfassen. Da dieses Bedürfnis nur bei einem speziellen Kunden besteht, soll sich für die übrigen Anwender möglichst wenig ändern. Die für die Erweiterung erforderliche Veränderung der Datei wird durch das Kontrollkästchen \"Futtermittel erweitern\" auf dem Blatt \"Inv\" angestossen. Kleinere Formatkorrekturen"]
["2015-06-29","Impex",2.6,"DFE: Anpassung zur Erhebung der maximalen Anzahl der Stallplätze, Code und feste Einträge pro Tierkategorie einfügen. Zusätzliche Spalten im Kopf: Adresszusatz und eMail-Adresse, Anpassungen im Programm in Prozedur Uebertrag, Anpassung für Formatierung von Betriebsnummer und Namen in den Kopfzeilen (alle A- und B-Blätter, Plausi)","?"]
[null,null,null,"Hinweis aud den A2-Blättern bei Schweinen bzgl. der Kategorien geändert, Textanpassung Impex (Einverständniserkl.)","Th. Schildknecht"]
[null,null,null,"Drucksteuerung auch für Mastpoulets (Stall1 bis Zusammenfassung) korrekt angepasst, Inhaltsverzeichnis vollständig mit korr. Seitenzahlen","UJA"]
["2016-02-22","Impex","2.6a","Poulet-Blätter: Korrektur im 1. Umtrieb, damit er auch dann richtig ist, wenn er auch der letzte im Berichtsjahr ist.\nKorrektur für Ausstallung am 31.Dezember: Auch dann muss der Umtrieb als komplett im Berichtsjahr zählen.","2 Supportfälle\nKorr. IWE / DFE"]
["2017-04-25","Impex",2.7,"DFE: gemäss Spezifikation IWE","GT Nov. 2016"]
["2017-04-27","Impex",2.7,"Einbau Finisher ","DFE: Zeit-Optimierung"]
[null,"Impex",null,"Verbesserungen Speichern Unter (Einschränkung DateiFormate)","DFE: Bedienungs-Optimierung"]
["2017-05-18","Impex",null,"Neues PW"]
["2017-11-21","Impex","2.7a","Korrektur Formel Tabelle Impex Zelle E64: Bezug E11 -> I11","DFE/IWE <- Th.Schildkn."]
["2017-12-11","Impex","2.7a","Seiteneinrichtung für Blatt \"Impex\"","DFE gem. Mail v. UJA"]
["2018-03-02","Impex",2.8,"DFE, gemäss Spezifikation von IWE, 2018_2 und Korr. Durch Thomas Schildknecht: Austausch von Werten, Periode von Mastpoulets unabh. vom Kalenderjahr, Codeschutz-Pw, neues PW."]
["2019-03-05","Impex","2.9","DFE, gemäss Spez von IWE, 20190219, Ergänzung Getreide Ganzpflanzen-Silage, Update Ntot, Datenübernahme"]
[]
["2022-03-21","Impex","2.11","DFE, gem. Spez IWE"]